null
SMILES: OC(=O)c1cccc(Nc2cc3C(=O)c4ccccc4C(=O)c3c3nonc23)c1
InChI Key: InChIKey=QBYHQVGILQFULK-UHFFFAOYSA-N
Activity Spreadsheet -- Enzyme Inhibition Constant Data from BindingDB
Found 1 hit for monomerid = 225839
Trg + Lig
Ki
nM
ΔG°
kcal/mole
IC50
nM
Kd
nM
EC50/IC50
nM
koff
s-1
kon
M-1s-1
pHTemp
°C
Heat shock protein HSP 90-beta
(Homo sapiens (Human))
BDBM225839
(hsp90_130)
Show SMILES OC(=O)c1cccc(Nc2cc3C(=O)c4ccccc4C(=O)c3c3nonc23)c1
Show InChI InChI=1S/C21H11N3O5/c25-19-12-6-1-2-7-13(12)20(26)16-14(19)9-15(17-18(16)24-29-23-17)22-11-5-3-4-10(8-11)21(27)28/h1-9,22H,(H,27,28)
Reactome pathway
D3R
n/an/a 10n/an/an/an/an/an/a
D3R
Assay Description
FRET Assay 1
D3R 408: (2016)
BindingDB Entry DOI: 10.7270/Q2VX0FC0