null
SMILES: CC(=O)Oc1ccc2c(oc(C)c(Cc3ccccc3)c2=O)c1OC(C)=O
InChI Key: InChIKey=CXESPDWARXTCQZ-UHFFFAOYSA-N
Activity Spreadsheet -- Enzyme Inhibition Constant Data from BindingDB
Found 2 hits for monomerid = 225875
Trg + Lig
Ki
nM
ΔG°
kcal/mole
IC50
nM
Kd
nM
EC50/IC50
nM
koff
s-1
kon
M-1s-1
pHTemp
°C
Heat shock protein HSP 90-beta
(Homo sapiens (Human))
BDBM225875
(hsp90_174)
Show SMILES CC(=O)Oc1ccc2c(oc(C)c(Cc3ccccc3)c2=O)c1OC(C)=O
Show InChI InChI=1S/C21H18O6/c1-12-17(11-15-7-5-4-6-8-15)19(24)16-9-10-18(26-13(2)22)21(20(16)25-12)27-14(3)23/h4-10H,11H2,1-3H3
Reactome pathway
D3R
n/an/an/a>1.00E+5n/an/an/an/an/a
D3R
Assay Description
Thermofluor Assay
D3R 408: (2016)
BindingDB Entry DOI: 10.7270/Q2VX0FC0
Heat shock protein HSP 90-beta
(Homo sapiens (Human))
BDBM225875
(hsp90_174)
Show SMILES CC(=O)Oc1ccc2c(oc(C)c(Cc3ccccc3)c2=O)c1OC(C)=O
Show InChI InChI=1S/C21H18O6/c1-12-17(11-15-7-5-4-6-8-15)19(24)16-9-10-18(26-13(2)22)21(20(16)25-12)27-14(3)23/h4-10H,11H2,1-3H3
Reactome pathway
D3R
n/an/a 13.7n/an/an/an/an/an/a
D3R
Assay Description
FRET Assay 1
D3R 408: (2016)
BindingDB Entry DOI: 10.7270/Q2VX0FC0