BDBM225899 MAP17
SMILES: CNC(=O)c1ccc2-c3c(C)c(nn3CCOc2c1)-c1ncnn1-c1ccc(F)cc1F
InChI Key: InChIKey=MUJJVOYNTCTXIC-UHFFFAOYSA-N
Data: 1 KI  1 IC50
Activity Spreadsheet -- Enzyme Inhibition Constant Data from BindingDB
Found 1 hit for monomerid = 225899
Trg + Lig
Ki
nM
ΔG°
kcal/mole
IC50
nM
Kd
nM
EC50/IC50
nM
koff
s-1
kon
M-1s-1
pHTemp
°C
Mitogen-activated protein kinase kinase kinase kinase 4
(Homo sapiens (Human))
BDBM225899
(MAP17)
Show SMILES CNC(=O)c1ccc2-c3c(C)c(nn3CCOc2c1)-c1ncnn1-c1ccc(F)cc1F
Show InChI InChI=1S/C22H18F2N6O2/c1-12-19(21-26-11-27-30(21)17-6-4-14(23)10-16(17)24)28-29-7-8-32-18-9-13(22(31)25-2)3-5-15(18)20(12)29/h3-6,9-11H,7-8H2,1-2H3,(H,25,31)
NCI pathway
Reactome pathway
D3R
6.50E+3n/a 1.00E+4n/an/an/an/an/an/a
D3R
Assay Description
Z'Lyte Assay
D3R 409: (2016)
BindingDB Entry DOI: 10.7270/Q2R49PN1