null
SMILES: O=C(NC1CCCCC1)[C@H](C1CCCCC1)n1c(nc2ccccc12)-c1ccc(cc1)C(=O)c1ccccc1
InChI Key: InChIKey=UYOADCMXWNRRPQ-HKBQPEDESA-N
PDB links: 1 PDB ID matches this monomer.
Activity Spreadsheet -- Enzyme Inhibition Constant Data from BindingDB
Found 1 hit for monomerid = 225924
Trg + Lig
Ki
nM
ΔG°
kcal/mole
IC50
nM
Kd
nM
EC50/IC50
nM
koff
s-1
kon
M-1s-1
pHTemp
°C
Bile acid receptor
(Homo sapiens (Human))
BDBM225924
(FXR_13)
Show SMILES O=C(NC1CCCCC1)[C@H](C1CCCCC1)n1c(nc2ccccc12)-c1ccc(cc1)C(=O)c1ccccc1
Show InChI InChI=1S/C34H37N3O2/c38-32(25-14-6-2-7-15-25)26-20-22-27(23-21-26)33-36-29-18-10-11-19-30(29)37(33)31(24-12-4-1-5-13-24)34(39)35-28-16-8-3-9-17-28/h2,6-7,10-11,14-15,18-24,28,31H,1,3-5,8-9,12-13,16-17H2,(H,35,39)/t31-/m0/s1
NCI pathway
Reactome pathway
D3R
n/an/a 24.4n/an/an/an/a7.4n/a
D3R
Assay Description
The assay buffer contained 50 mM HEPES (pH 7.4), 10 mM NaCl, 5 mM MgCl2 and 0.01% CHAPS. The reactions were incubated for 30 min in the presence of [...
D3R 882: (2017)
BindingDB Entry DOI: 10.7270/Q2MC8XWV
3D
3D Structure (crystal)