null
SMILES: OC(=O)c1ccc(OC[C@H](C2CCCCC2)n2c(nc3cc(F)c(F)cc23)-c2ccc(Cl)cc2)c(F)c1
InChI Key: InChIKey=CPOSGAZIIDJVMJ-RUZDIDTESA-N
PDB links: 1 PDB ID matches this monomer.
Activity Spreadsheet -- Enzyme Inhibition Constant Data from BindingDB
Found 1 hit for monomerid = 225938
Trg + Lig
Ki
nM
ΔG°
kcal/mole
IC50
nM
Kd
nM
EC50/IC50
nM
koff
s-1
kon
M-1s-1
pHTemp
°C
Bile acid receptor
(Homo sapiens (Human))
BDBM225938
(FXR_28)
Show SMILES OC(=O)c1ccc(OC[C@H](C2CCCCC2)n2c(nc3cc(F)c(F)cc23)-c2ccc(Cl)cc2)c(F)c1
Show InChI InChI=1S/C28H24ClF3N2O3/c29-19-9-6-17(7-10-19)27-33-23-13-20(30)21(31)14-24(23)34(27)25(16-4-2-1-3-5-16)15-37-26-11-8-18(28(35)36)12-22(26)32/h6-14,16,25H,1-5,15H2,(H,35,36)/t25-/m1/s1
NCI pathway
Reactome pathway
D3R
n/an/a 21n/an/an/an/a7.4n/a
D3R
Assay Description
The assay buffer contained 50 mM HEPES (pH 7.4), 10 mM NaCl, 5 mM MgCl2 and 0.01% CHAPS. The reactions were incubated for 30 min in the presence of [...
D3R 882: (2017)
BindingDB Entry DOI: 10.7270/Q2MC8XWV
3D
3D Structure (crystal)