BDBM225941 FXR_31
SMILES: COc1ccc(-c2nc3cc(F)c(F)cc3n2[C@@H](C2CCCCC2)C(=O)N[C@H]2CC[C@H](O)CC2)c(OC)n1
InChI Key: InChIKey=JBIUFHDYJMTSIW-RPPIVITFSA-N
Data: 1 IC50
PDB links: 1 PDB ID matches this monomer.
Activity Spreadsheet -- Enzyme Inhibition Constant Data from BindingDB
Found 1 hit for monomerid = 225941
Trg + Lig
Ki
nM
ΔG°
kcal/mole
IC50
nM
Kd
nM
EC50/IC50
nM
koff
s-1
kon
M-1s-1
pHTemp
°C
Bile acid receptor
(Homo sapiens (Human))
BDBM225941
(FXR_31)
Show SMILES COc1ccc(-c2nc3cc(F)c(F)cc3n2[C@@H](C2CCCCC2)C(=O)N[C@H]2CC[C@H](O)CC2)c(OC)n1 |wU:17.18,27.29,wD:30.33,(-8.1,.03,;-7.33,-1.3,;-5.79,-1.3,;-5.02,-2.64,;-3.48,-2.64,;-2.71,-1.3,;-1.17,-1.3,;-.27,-.06,;1.2,-.53,;2.53,.24,;3.86,-.53,;5.2,.24,;3.86,-2.07,;5.2,-2.84,;2.53,-2.84,;1.2,-2.07,;-.27,-2.55,;-.74,-4.01,;.29,-5.16,;1.79,-4.84,;2.82,-5.98,;2.35,-7.45,;.84,-7.77,;-.19,-6.62,;-2.25,-4.33,;-3.28,-3.19,;-2.73,-5.8,;-4.23,-6.12,;-4.71,-7.58,;-6.21,-7.9,;-7.25,-6.76,;-8.75,-7.08,;-6.77,-5.29,;-5.26,-4.97,;-3.48,.03,;-2.71,1.36,;-3.48,2.7,;-5.02,.03,)|
Show InChI InChI=1S/C28H34F2N4O4/c1-37-24-13-12-19(28(33-24)38-2)26-32-22-14-20(29)21(30)15-23(22)34(26)25(16-6-4-3-5-7-16)27(36)31-17-8-10-18(35)11-9-17/h12-18,25,35H,3-11H2,1-2H3,(H,31,36)/t17-,18-,25-/m0/s1
NCI pathway
Reactome pathway
D3R
n/an/a 8.40n/an/an/an/a7.4n/a
D3R
Assay Description
The assay buffer contained 50 mM HEPES (pH 7.4), 10 mM NaCl, 5 mM MgCl2 and 0.01% CHAPS. The reactions were incubated for 30 min in the presence of [...
D3R 882: (2017)
BindingDB Entry DOI: 10.7270/Q2MC8XWV
3D
3D Structure (crystal)