BDBM226426 5-{6-(5-chloropyridin-3- yl)-8-[1-fluoro-1-(2- fluorophenyl)ethyl]-7- [(trans-4- methylcyclohexyl)methyl]- 7h-purin-2-yl}-1,3,4- oxadiazol-2(3h)-one (enantiomer 1)::US9540377, 23.32::US9540377, 23.33
SMILES: C[C@H]1CC[C@H](Cn2c(nc3nc(nc(-c4cncc(Cl)c4)c23)-c2n[nH]c(=O)o2)C(C)(F)c2ccccc2F)CC1
InChI Key:
Data: 2 IC50
Activity Spreadsheet -- Enzyme Inhibition Constant Data from BindingDB
Found 2 hits for monomerid = 226426
Trg + Lig
Ki
nM
ΔG°
kcal/mole
IC50
nM
Kd
nM
EC50/IC50
nM
koff
s-1
kon
M-1s-1
pHTemp
°C
p53-binding protein Mdm2
(Homo sapiens (Human))
BDBM226426
(5-{6-(5-chloropyridin-3- yl)-8-[1-fluoro-1-(2- flu...)
Show SMILES C[C@H]1CC[C@H](Cn2c(nc3nc(nc(-c4cncc(Cl)c4)c23)-c2n[nH]c(=O)o2)C(C)(F)c2ccccc2F)CC1 |r,wU:4.4,wD:1.0,(7.09,-3.69,;5.6,-3.29,;5.21,-1.81,;3.72,-1.41,;2.63,-2.5,;1.14,-2.1,;.74,-.61,;1.65,.64,;.74,1.88,;-.72,1.41,;-2.05,2.18,;-3.39,1.41,;-3.39,-.13,;-2.05,-.9,;-2.05,-2.44,;-.72,-3.21,;-.72,-4.75,;-2.05,-5.52,;-3.39,-4.75,;-4.72,-5.52,;-3.39,-3.21,;-.72,-.13,;-4.72,2.18,;-6.19,1.7,;-7.09,2.95,;-6.19,4.19,;-6.96,5.52,;-4.72,3.72,;3.19,.64,;3.96,-.7,;4.73,.64,;3.96,1.97,;5.5,1.97,;6.27,3.3,;5.5,4.64,;3.96,4.64,;3.19,3.3,;1.65,3.3,;3.03,-3.98,;4.52,-4.38,)|
US Patent
n/an/a 0.453n/an/an/an/an/a25
Merck Sharp & Dohme Corp.
US Patent
Assay Description
An HDM2 FRET assay was developed to assess the compounds' inhibitory activity towards binding of p53 protein. A truncated version of HDM2 with re...
US Patent US9540377 (2017)
BindingDB Entry DOI: 10.7270/Q2RF5X1F
p53-binding protein Mdm2
(Homo sapiens (Human))
BDBM226426
(5-{6-(5-chloropyridin-3- yl)-8-[1-fluoro-1-(2- flu...)
Show SMILES C[C@H]1CC[C@H](Cn2c(nc3nc(nc(-c4cncc(Cl)c4)c23)-c2n[nH]c(=O)o2)C(C)(F)c2ccccc2F)CC1 |r,wU:4.4,wD:1.0,(7.09,-3.69,;5.6,-3.29,;5.21,-1.81,;3.72,-1.41,;2.63,-2.5,;1.14,-2.1,;.74,-.61,;1.65,.64,;.74,1.88,;-.72,1.41,;-2.05,2.18,;-3.39,1.41,;-3.39,-.13,;-2.05,-.9,;-2.05,-2.44,;-.72,-3.21,;-.72,-4.75,;-2.05,-5.52,;-3.39,-4.75,;-4.72,-5.52,;-3.39,-3.21,;-.72,-.13,;-4.72,2.18,;-6.19,1.7,;-7.09,2.95,;-6.19,4.19,;-6.96,5.52,;-4.72,3.72,;3.19,.64,;3.96,-.7,;4.73,.64,;3.96,1.97,;5.5,1.97,;6.27,3.3,;5.5,4.64,;3.96,4.64,;3.19,3.3,;1.65,3.3,;3.03,-3.98,;4.52,-4.38,)|
US Patent
n/an/a 16.0n/an/an/an/an/a25
Merck Sharp & Dohme Corp.
US Patent
Assay Description
An HDM2 FRET assay was developed to assess the compounds' inhibitory activity towards binding of p53 protein. A truncated version of HDM2 with re...
US Patent US9540377 (2017)
BindingDB Entry DOI: 10.7270/Q2RF5X1F