BDBM22643 N-Me-pyrimidone deriv., 42::N-[(4-fluorophenyl)methyl]-5-hydroxy-2-(4-methanesulfonyl-1-methylpiperazin-2-yl)-1-methyl-6-oxo-1,6-dihydropyrimidine-4-carboxamide
SMILES: CN1CCN(CC1c1nc(C(=O)NCc2ccc(F)cc2)c(O)c(=O)n1C)S(C)(=O)=O
InChI Key: InChIKey=MWPWGZXQCAMTQA-UHFFFAOYSA-N
Data: 2 IC50
Activity Spreadsheet -- Enzyme Inhibition Constant Data from BindingDB
Found 2 hits for monomerid = 22643
Trg + Lig
Ki
nM
ΔG°
kcal/mole
IC50
nM
Kd
nM
EC50/IC50
nM
koff
s-1
kon
M-1s-1
pHTemp
°C
Integrase
(Human immunodeficiency virus 1)
BDBM22643
(N-Me-pyrimidone deriv., 42 | N-[(4-fluorophenyl)me...)
Show SMILES CN1CCN(CC1c1nc(C(=O)NCc2ccc(F)cc2)c(O)c(=O)n1C)S(C)(=O)=O
Show InChI InChI=1S/C19H24FN5O5S/c1-23-8-9-25(31(3,29)30)11-14(23)17-22-15(16(26)19(28)24(17)2)18(27)21-10-12-4-6-13(20)7-5-12/h4-7,14,26H,8-11H2,1-3H3,(H,21,27)
n/an/a 30n/an/an/an/an/an/a
IRBM-Merck Research Laboratories Rome
Curated by ChEMBL
Assay Description
Inhibition of recombinant HIV-1 integrase strand transfer activity
Bioorg Med Chem Lett 19: 4617-21 (2009)
Article DOI: 10.1016/j.bmcl.2009.06.091
BindingDB Entry DOI: 10.7270/Q24F1TJT
Gag-Pol polyprotein
(Human immunodeficiency virus type 1 group M subtyp...)
BDBM22643
(N-Me-pyrimidone deriv., 42 | N-[(4-fluorophenyl)me...)
Show SMILES CN1CCN(CC1c1nc(C(=O)NCc2ccc(F)cc2)c(O)c(=O)n1C)S(C)(=O)=O
Show InChI InChI=1S/C19H24FN5O5S/c1-23-8-9-25(31(3,29)30)11-14(23)17-22-15(16(26)19(28)24(17)2)18(27)21-10-12-4-6-13(20)7-5-12/h4-7,14,26H,8-11H2,1-3H3,(H,21,27)
n/an/a 11n/an/an/an/an/an/a
IRBM-MRL
Assay Description
The microtiter plate assay for stand transfer was performed with an immobilized donor substrate and a target substrate biotinylated at the 3-prime en...
J Med Chem 50: 4953-75 (2007)
Article DOI: 10.1021/jm0704705
BindingDB Entry DOI: 10.7270/Q2BZ64BS