BDBM226441 US9328096, 134
SMILES: CC(C)(C)CNC(=O)c1cc(NC(=O)c2cc(c(Cl)cc2Cl)-c2ncccc2F)n(n1)-c1ccccc1
InChI Key: InChIKey=KIAQIIDWTXPHEE-UHFFFAOYSA-N
Data: 1 IC50
Activity Spreadsheet -- Enzyme Inhibition Constant Data from BindingDB
Found 1 hit for monomerid = 226441
Trg + Lig
Ki
nM
ΔG°
kcal/mole
IC50
nM
Kd
nM
EC50/IC50
nM
koff
s-1
kon
M-1s-1
pHTemp
°C
Tyrosine kinase receptor A (TrkA)
(Homo sapiens (Human))
BDBM226441
(US9328096, 134)
Show SMILES CC(C)(C)CNC(=O)c1cc(NC(=O)c2cc(c(Cl)cc2Cl)-c2ncccc2F)n(n1)-c1ccccc1
Show InChI InChI=1S/C27H24Cl2FN5O2/c1-27(2,3)15-32-26(37)22-14-23(35(34-22)16-8-5-4-6-9-16)33-25(36)18-12-17(19(28)13-20(18)29)24-21(30)10-7-11-31-24/h4-14H,15H2,1-3H3,(H,32,37)(H,33,36)
US Patent
n/an/a 4.61n/an/an/an/an/a37
Pfizer Inc.
US Patent
Assay Description
TRKA co-expressed with p75: The assays are based upon DiscoveRx's proprietary Enzyme Fragment Complementation (EFC) technology. In the case of the TR...
US Patent US9328096 (2016)
BindingDB Entry DOI: 10.7270/Q2FN152J