BDBM2266 2-Pyridinone derivative 46::3-[2-(1,3-benzoxazol-2-yl)ethyl]-5,6-dimethyl-1,2-dihydropyridin-2-one::3-[2-(benzoxazol-2-yl)ethyl]-5,6-dimethylpyridin-2(1H)-one::CHEMBL426396
SMILES: Cc1cc(CCc2nc3ccccc3o2)c(=O)[nH]c1C
InChI Key: InChIKey=VAZJLRKZTHLQMK-UHFFFAOYSA-N
Data: 2 IC50
Activity Spreadsheet -- Enzyme Inhibition Constant Data from BindingDB
Found 2 hits for monomerid = 2266
Trg + Lig
Ki
nM
ΔG°
kcal/mole
IC50
nM
Kd
nM
EC50/IC50
nM
koff
s-1
kon
M-1s-1
pHTemp
°C
Human immunodeficiency virus type 1 reverse transcriptase
(Human immunodeficiency virus 1)
BDBM2266
(2-Pyridinone derivative 46 | 3-[2-(1,3-benzoxazol-...)
Show SMILES Cc1cc(CCc2nc3ccccc3o2)c(=O)[nH]c1C
Show InChI InChI=1S/C16H16N2O2/c1-10-9-12(16(19)17-11(10)2)7-8-15-18-13-5-3-4-6-14(13)20-15/h3-6,9H,7-8H2,1-2H3,(H,17,19)
n/an/a 170n/an/an/an/an/an/a
Merck Reserch Laboratories
Curated by ChEMBL
Assay Description
Tested for inhibition against HIV-1 RT (used (poly)rC-(oligo)dG as the template)
J Med Chem 36: 953-66 (1993)
BindingDB Entry DOI: 10.7270/Q2JW8G28
HIV-1 Reverse Transcriptase
(Human immunodeficiency virus type 1)
BDBM2266
(2-Pyridinone derivative 46 | 3-[2-(1,3-benzoxazol-...)
Show SMILES Cc1cc(CCc2nc3ccccc3o2)c(=O)[nH]c1C
Show InChI InChI=1S/C16H16N2O2/c1-10-9-12(16(19)17-11(10)2)7-8-15-18-13-5-3-4-6-14(13)20-15/h3-6,9H,7-8H2,1-2H3,(H,17,19)
n/an/a 170n/an/an/an/an/an/a
Merck Reserch Laboratories
Curated by ChEMBL
Assay Description
The IC50 of reverse transcriptase is the concentration that inhibits 50% of recombinant HIV-1 RT RNA-directed DNA polymerase activity in vitro.
J Med Chem 36: 953-66 (1993)
BindingDB Entry DOI: 10.7270/Q2JW8G28