BDBM22682 Bicyclic pyrimidinone, 15b::N-[(4-fluorophenyl)methyl]-3-hydroxy-9-[N-methyl-2-(1H-pyrazol-1-yl)acetamido]-4-oxo-4H,6H,7H,8H,9H-pyrido[1,2-a]pyrimidine-2-carboxamide
SMILES: CN(C1CCCn2c1nc(C(=O)NCc1ccc(F)cc1)c(O)c2=O)C(=O)Cn1cccn1
InChI Key: InChIKey=KPJHOLUWNNZYHG-UHFFFAOYSA-N
Data: 1 IC50
Activity Spreadsheet -- Enzyme Inhibition Constant Data from BindingDB
Found 1 hit for monomerid = 22682
Trg + Lig
Ki
nM
ΔG°
kcal/mole
IC50
nM
Kd
nM
EC50/IC50
nM
koff
s-1
kon
M-1s-1
pHTemp
°C
Gag-Pol polyprotein
(Human immunodeficiency virus type 1 group M subtyp...)
BDBM22682
(Bicyclic pyrimidinone, 15b | N-[(4-fluorophenyl)me...)
Show SMILES CN(C1CCCn2c1nc(C(=O)NCc1ccc(F)cc1)c(O)c2=O)C(=O)Cn1cccn1
Show InChI InChI=1S/C22H23FN6O4/c1-27(17(30)13-28-10-3-9-25-28)16-4-2-11-29-20(16)26-18(19(31)22(29)33)21(32)24-12-14-5-7-15(23)8-6-14/h3,5-10,16,31H,2,4,11-13H2,1H3,(H,24,32)
n/an/a 3n/an/an/an/a7.837
IRBM-MRL
Assay Description
The microtiter plate assay for stand transfer was performed with an immobilized donor substrate and a target substrate biotinylated at the 3-prime en...
J Med Chem 51: 861-74 (2008)
Article DOI: 10.1021/jm701164t
BindingDB Entry DOI: 10.7270/Q2765CNT