BDBM226838 US9328096, 531
SMILES: OCC1(CC1)NC(=O)c1cc(NC(=O)c2cc(c(Cl)cc2Cl)-c2ncccc2F)n(n1)-c1ccccc1
InChI Key: InChIKey=RFUXVLYCHJNLGJ-UHFFFAOYSA-N
Data: 1 IC50
Activity Spreadsheet -- Enzyme Inhibition Constant Data from BindingDB
Found 1 hit for monomerid = 226838
Trg + Lig
Ki
nM
ΔG°
kcal/mole
IC50
nM
Kd
nM
EC50/IC50
nM
koff
s-1
kon
M-1s-1
pHTemp
°C
Tyrosine kinase receptor A (TrkA)
(Homo sapiens (Human))
BDBM226838
(US9328096, 531)
Show SMILES OCC1(CC1)NC(=O)c1cc(NC(=O)c2cc(c(Cl)cc2Cl)-c2ncccc2F)n(n1)-c1ccccc1
Show InChI InChI=1S/C26H20Cl2FN5O3/c27-18-12-19(28)17(11-16(18)23-20(29)7-4-10-30-23)24(36)31-22-13-21(25(37)32-26(14-35)8-9-26)33-34(22)15-5-2-1-3-6-15/h1-7,10-13,35H,8-9,14H2,(H,31,36)(H,32,37)
US Patent
n/an/a 3.41n/an/an/an/an/a37
Pfizer Inc.
US Patent
Assay Description
TRKA co-expressed with p75: The assays are based upon DiscoveRx's proprietary Enzyme Fragment Complementation (EFC) technology. In the case of the TR...
US Patent US9328096 (2016)
BindingDB Entry DOI: 10.7270/Q2FN152J