BDBM226882 US9328096, 575
SMILES: Fc1cccnc1-c1cc(C(=O)Nc2cc(nn2-c2ccccc2)C(=O)NCc2cccnn2)c(Cl)cc1Cl
InChI Key: InChIKey=WWRZVLBGVFPEKO-UHFFFAOYSA-N
Data: 1 IC50
Activity Spreadsheet -- Enzyme Inhibition Constant Data from BindingDB
Found 1 hit for monomerid = 226882
Trg + Lig
Ki
nM
ΔG°
kcal/mole
IC50
nM
Kd
nM
EC50/IC50
nM
koff
s-1
kon
M-1s-1
pHTemp
°C
Tyrosine kinase receptor A (TrkA)
(Homo sapiens (Human))
BDBM226882
(US9328096, 575)
Show SMILES Fc1cccnc1-c1cc(C(=O)Nc2cc(nn2-c2ccccc2)C(=O)NCc2cccnn2)c(Cl)cc1Cl
Show InChI InChI=1S/C27H18Cl2FN7O2/c28-20-13-21(29)19(12-18(20)25-22(30)9-5-10-31-25)26(38)34-24-14-23(36-37(24)17-7-2-1-3-8-17)27(39)32-15-16-6-4-11-33-35-16/h1-14H,15H2,(H,32,39)(H,34,38)
US Patent
n/an/a 3.21n/an/an/an/an/a37
Pfizer Inc.
US Patent
Assay Description
TRKA co-expressed with p75: The assays are based upon DiscoveRx's proprietary Enzyme Fragment Complementation (EFC) technology. In the case of the TR...
US Patent US9328096 (2016)
BindingDB Entry DOI: 10.7270/Q2FN152J