BDBM22699 Bicyclic pyrimidinone, 23c::N-[(4-fluorophenyl)methyl]-3-hydroxy-10-(6-methyl-1,1-dioxo-1,2,6-thiadiazinan-2-yl)-4-oxo-4H,6H,7H,8H,9H,10H-pyrimido[1,2-a]azepine-2-carboxamide
SMILES: CN1CCCN(C2CCCCn3c2nc(C(=O)NCc2ccc(F)cc2)c(O)c3=O)S1(=O)=O
InChI Key: InChIKey=MLZLLJYDSOKIQG-UHFFFAOYSA-N
Data: 1 IC50
Activity Spreadsheet -- Enzyme Inhibition Constant Data from BindingDB
Found 1 hit for monomerid = 22699
Trg + Lig
Ki
nM
ΔG°
kcal/mole
IC50
nM
Kd
nM
EC50/IC50
nM
koff
s-1
kon
M-1s-1
pHTemp
°C
Gag-Pol polyprotein
(Human immunodeficiency virus type 1 group M subtyp...)
BDBM22699
(Bicyclic pyrimidinone, 23c | N-[(4-fluorophenyl)me...)
Show SMILES CN1CCCN(C2CCCCn3c2nc(C(=O)NCc2ccc(F)cc2)c(O)c3=O)S1(=O)=O
Show InChI InChI=1S/C21H26FN5O5S/c1-25-10-4-12-27(33(25,31)32)16-5-2-3-11-26-19(16)24-17(18(28)21(26)30)20(29)23-13-14-6-8-15(22)9-7-14/h6-9,16,28H,2-5,10-13H2,1H3,(H,23,29)
n/an/a 6n/an/an/an/an/an/a
IRBM-MRL
Assay Description
The microtiter plate assay for stand transfer was performed with an immobilized donor substrate and a target substrate biotinylated at the 3-prime en...
J Med Chem 51: 861-74 (2008)
Article DOI: 10.1021/jm701164t
BindingDB Entry DOI: 10.7270/Q2765CNT