BDBM22705 (9S)-N-[(4-fluorophenyl)methyl]-3-hydroxy-9-{methyl[(4-methylpiperazine-1-)sulfonyl]amino}-4-oxo-4H,6H,7H,8H,9H-pyrido[1,2-a]pyrimidine-2-carboxamide::Bicyclic pyrimidinone, (S)-27b
SMILES: CN([C@H]1CCCn2c1nc(C(=O)NCc1ccc(F)cc1)c(O)c2=O)S(=O)(=O)N1CCN(C)CC1
InChI Key: InChIKey=YLIYNHWYALYMOQ-KRWDZBQOSA-N
Data: 1 IC50
Activity Spreadsheet -- Enzyme Inhibition Constant Data from BindingDB
Found 1 hit for monomerid = 22705
Trg + Lig
Ki
nM
ΔG°
kcal/mole
IC50
nM
Kd
nM
EC50/IC50
nM
koff
s-1
kon
M-1s-1
pHTemp
°C
Gag-Pol polyprotein
(Human immunodeficiency virus type 1 group M subtyp...)
BDBM22705
((9S)-N-[(4-fluorophenyl)methyl]-3-hydroxy-9-{methy...)
Show SMILES CN([C@H]1CCCn2c1nc(C(=O)NCc1ccc(F)cc1)c(O)c2=O)S(=O)(=O)N1CCN(C)CC1 |r|
Show InChI InChI=1S/C22H29FN6O5S/c1-26-10-12-28(13-11-26)35(33,34)27(2)17-4-3-9-29-20(17)25-18(19(30)22(29)32)21(31)24-14-15-5-7-16(23)8-6-15/h5-8,17,30H,3-4,9-14H2,1-2H3,(H,24,31)/t17-/m0/s1
n/an/a 7n/an/an/an/an/an/a
IRBM-MRL
Assay Description
The microtiter plate assay for stand transfer was performed with an immobilized donor substrate and a target substrate biotinylated at the 3-prime en...
J Med Chem 51: 861-74 (2008)
Article DOI: 10.1021/jm701164t
BindingDB Entry DOI: 10.7270/Q2765CNT