BDBM22707 Bicyclic pyrimidinone, 28b::N-(2-{[(4-fluorophenyl)methyl]carbamoyl}-3-hydroxy-4-oxo-4H,6H,7H,8H,9H-pyrido[1,2-a]pyrimidin-9-yl)-N',N',N''-trimethylethanediamide
SMILES: CN(C)C(=O)C(=O)N(C)C1CCCn2c1nc(C(=O)NCc1ccc(F)cc1)c(O)c2=O
InChI Key: InChIKey=ZQDWKAJNPJBABY-UHFFFAOYSA-N
Data: 1 IC50
Activity Spreadsheet -- Enzyme Inhibition Constant Data from BindingDB
Found 1 hit for monomerid = 22707
Trg + Lig
Ki
nM
ΔG°
kcal/mole
IC50
nM
Kd
nM
EC50/IC50
nM
koff
s-1
kon
M-1s-1
pHTemp
°C
Gag-Pol polyprotein
(Human immunodeficiency virus type 1 group M subtyp...)
BDBM22707
(Bicyclic pyrimidinone, 28b | N-(2-{[(4-fluoropheny...)
Show SMILES CN(C)C(=O)C(=O)N(C)C1CCCn2c1nc(C(=O)NCc1ccc(F)cc1)c(O)c2=O
Show InChI InChI=1S/C21H24FN5O5/c1-25(2)20(31)21(32)26(3)14-5-4-10-27-17(14)24-15(16(28)19(27)30)18(29)23-11-12-6-8-13(22)9-7-12/h6-9,14,28H,4-5,10-11H2,1-3H3,(H,23,29)
n/an/a 7n/an/an/an/an/an/a
IRBM-MRL
Assay Description
The microtiter plate assay for stand transfer was performed with an immobilized donor substrate and a target substrate biotinylated at the 3-prime en...
J Med Chem 51: 861-74 (2008)
Article DOI: 10.1021/jm701164t
BindingDB Entry DOI: 10.7270/Q2765CNT