BDBM227235 US9328106, 186
SMILES: Cn1ncc(NC(=O)c2nc(sc2N)-c2ccccc2F)c1[C@@H]1CC[C@@H](N)[C@@H](F)CO1
InChI Key: InChIKey=FXQXRXUKLGCVRL-GUTXKFCHSA-N
Data: 1 KI
Activity Spreadsheet -- Enzyme Inhibition Constant Data from BindingDB
Found 1 hit for monomerid = 227235
Trg + Lig
Ki
nM
ΔG°
kcal/mole
IC50
nM
Kd
nM
EC50/IC50
nM
koff
s-1
kon
M-1s-1
pHTemp
°C
Serine/threonine-protein kinase pim-1
(Homo sapiens (Human))
BDBM227235
(US9328106, 186)
Show SMILES Cn1ncc(NC(=O)c2nc(sc2N)-c2ccccc2F)c1[C@@H]1CC[C@@H](N)[C@@H](F)CO1 |r|
Show InChI InChI=1S/C20H22F2N6O2S/c1-28-17(15-7-6-13(23)12(22)9-30-15)14(8-25-28)26-19(29)16-18(24)31-20(27-16)10-4-2-3-5-11(10)21/h2-5,8,12-13,15H,6-7,9,23-24H2,1H3,(H,26,29)/t12-,13+,15-/m0/s1
US Patent
0.00700 -15.2n/an/an/an/an/a7.225
GENENTECH, INC.
US Patent
Assay Description
LC3K assay: PIM-1, -2, and -3 enzymes were generated as fusion proteins expressed in bacteria and purified by IMAC column chromatography (Sun, X., Ch...
US Patent US9328106 (2016)
BindingDB Entry DOI: 10.7270/Q29W0DBT