BDBM227266 US9328106, 217
SMILES: Cn1ncc(NC(=O)c2csc(n2)-c2c(F)cc(O[C@@H]3CCOC3)cc2F)c1[C@@H]1CC[C@@H](N)[C@H](F)CO1
InChI Key: InChIKey=FLBYITLVRZUOTE-HQNKDMIGSA-N
Data: 1 KI
Activity Spreadsheet -- Enzyme Inhibition Constant Data from BindingDB
Found 1 hit for monomerid = 227266
Trg + Lig
Ki
nM
ΔG°
kcal/mole
IC50
nM
Kd
nM
EC50/IC50
nM
koff
s-1
kon
M-1s-1
pHTemp
°C
Serine/threonine-protein kinase pim-1
(Homo sapiens (Human))
BDBM227266
(US9328106, 217)
Show SMILES Cn1ncc(NC(=O)c2csc(n2)-c2c(F)cc(O[C@@H]3CCOC3)cc2F)c1[C@@H]1CC[C@@H](N)[C@H](F)CO1 |r|
Show InChI InChI=1S/C24H26F3N5O4S/c1-32-22(20-3-2-17(28)16(27)10-35-20)18(8-29-32)30-23(33)19-11-37-24(31-19)21-14(25)6-13(7-15(21)26)36-12-4-5-34-9-12/h6-8,11-12,16-17,20H,2-5,9-10,28H2,1H3,(H,30,33)/t12-,16-,17-,20+/m1/s1
US Patent
0.00300 -15.7n/an/an/an/an/a7.225
GENENTECH, INC.
US Patent
Assay Description
LC3K assay: PIM-1, -2, and -3 enzymes were generated as fusion proteins expressed in bacteria and purified by IMAC column chromatography (Sun, X., Ch...
US Patent US9328106 (2016)
BindingDB Entry DOI: 10.7270/Q29W0DBT