BDBM227304 US9328106, 255
SMILES: Cc1c(cnn1C)-c1nc(C(=O)Nc2cnn(C)c2[C@@H]2CC[C@@H](N)[C@@H](F)CO2)c(N)s1
InChI Key: InChIKey=DPGXZYHVDNHUNY-SCRDCRAPSA-N
Data: 1 KI
Activity Spreadsheet -- Enzyme Inhibition Constant Data from BindingDB
Found 1 hit for monomerid = 227304
Trg + Lig
Ki
nM
ΔG°
kcal/mole
IC50
nM
Kd
nM
EC50/IC50
nM
koff
s-1
kon
M-1s-1
pHTemp
°C
Serine/threonine-protein kinase pim-1
(Homo sapiens (Human))
BDBM227304
(US9328106, 255)
Show SMILES Cc1c(cnn1C)-c1nc(C(=O)Nc2cnn(C)c2[C@@H]2CC[C@@H](N)[C@@H](F)CO2)c(N)s1 |r|
Show InChI InChI=1S/C19H25FN8O2S/c1-9-10(6-23-27(9)2)19-26-15(17(22)31-19)18(29)25-13-7-24-28(3)16(13)14-5-4-12(21)11(20)8-30-14/h6-7,11-12,14H,4-5,8,21-22H2,1-3H3,(H,25,29)/t11-,12+,14-/m0/s1
US Patent
0.00700 -15.2n/an/an/an/an/a7.225
GENENTECH, INC.
US Patent
Assay Description
LC3K assay: PIM-1, -2, and -3 enzymes were generated as fusion proteins expressed in bacteria and purified by IMAC column chromatography (Sun, X., Ch...
US Patent US9328106 (2016)
BindingDB Entry DOI: 10.7270/Q29W0DBT