BDBM227549 US9334278, I-37
SMILES: Cc1nc2[nH]cc(C(=O)NC(C)(C)C)c2nc1Nc1ccccc1
InChI Key: InChIKey=YEWLGDNGGAVSRO-UHFFFAOYSA-N
Data: 1 IC50
Activity Spreadsheet -- Enzyme Inhibition Constant Data from BindingDB
Found 1 hit for monomerid = 227549
Trg + Lig
Ki
nM
ΔG°
kcal/mole
IC50
nM
Kd
nM
EC50/IC50
nM
koff
s-1
kon
M-1s-1
pHTemp
°C
Tyrosine-protein kinase SYK [360-635]
(Homo sapiens (Human))
BDBM227549
(US9334278, I-37)
Show SMILES Cc1nc2[nH]cc(C(=O)NC(C)(C)C)c2nc1Nc1ccccc1
Show InChI InChI=1S/C18H21N5O/c1-11-15(21-12-8-6-5-7-9-12)22-14-13(10-19-16(14)20-11)17(24)23-18(2,3)4/h5-10H,1-4H3,(H,19,20)(H,21,22)(H,23,24)
US Patent
n/an/a 4.80n/an/an/an/an/a30
Hoffmann-La Roche Inc.
US Patent
Assay Description
Assay plates: 96-well MultiScreen 0.65 μm filter plates (Millipore Cat. No.: MADVNOB 10) Streptavidin coated beads: Streptavidin Sepharose™,...
US Patent US9334278 (2016)
BindingDB Entry DOI: 10.7270/Q2JD4VN3