BDBM227789 8-{[Ethyl(2-hydroxyethyl)amino]methyl}-4-[(2-fluoro-5-hydroxy-4-methylphenyl)amino]-6,11-dihydro-5H-pyrido[2,3-b][1,5]benzodiazepin-5-one::US10047096, 52
SMILES: CCN(CCO)Cc1ccc2Nc3nccc(Nc4cc(O)c(C)cc4F)c3C(=O)Nc2c1
InChI Key: InChIKey=PAHBMDHIMGYJEW-UHFFFAOYSA-N
Data: 2 IC50
Activity Spreadsheet -- Enzyme Inhibition Constant Data from BindingDB
Found 2 hits for monomerid = 227789
Trg + Lig
Ki
nM
ΔG°
kcal/mole
IC50
nM
Kd
nM
EC50/IC50
nM
koff
s-1
kon
M-1s-1
pHTemp
°C
Platelet-derived growth factor receptor beta
(Homo sapiens (Human))
BDBM227789
(8-{[Ethyl(2-hydroxyethyl)amino]methyl}-4-[(2-fluor...)
Show SMILES CCN(CCO)Cc1ccc2Nc3nccc(Nc4cc(O)c(C)cc4F)c3C(=O)Nc2c1
Show InChI InChI=1S/C24H26FN5O3/c1-3-30(8-9-31)13-15-4-5-17-20(11-15)29-24(33)22-18(6-7-26-23(22)28-17)27-19-12-21(32)14(2)10-16(19)25/h4-7,10-12,31-32H,3,8-9,13H2,1-2H3,(H,29,33)(H2,26,27,28)
NCI pathway
Reactome pathway
US Patent
n/an/a 1.10n/an/an/an/a7.522
Bayer Pharma Aktiengesellschaft
US Patent
Assay Description
The kinase used was a recombinant fusion protein composed of N-terminal GST and a C-terminal fragment of human PDGFRβ (amino acids R561-L1106), expr...
US Patent US10047096 (2018)
BindingDB Entry DOI: 10.7270/Q23R0VW4
Vascular endothelial growth factor receptor 2
(Homo sapiens (Human))
BDBM227789
(8-{[Ethyl(2-hydroxyethyl)amino]methyl}-4-[(2-fluor...)
Show SMILES CCN(CCO)Cc1ccc2Nc3nccc(Nc4cc(O)c(C)cc4F)c3C(=O)Nc2c1
Show InChI InChI=1S/C24H26FN5O3/c1-3-30(8-9-31)13-15-4-5-17-20(11-15)29-24(33)22-18(6-7-26-23(22)28-17)27-19-12-21(32)14(2)10-16(19)25/h4-7,10-12,31-32H,3,8-9,13H2,1-2H3,(H,29,33)(H2,26,27,28)
NCI pathway
Reactome pathway
US Patent
n/an/a 0.582n/an/an/an/a7.0n/a
Bayer Pharma Aktiengesellschaft
US Patent
Assay Description
The kinase used was a recombinant fusion protein composed of N-terminal GST and a C-terminal fragment of human KDR (amino acids D807-V1356), expresse...
US Patent US10047096 (2018)
BindingDB Entry DOI: 10.7270/Q23R0VW4