BDBM227814 4-[(2-Fluoro-5-hydroxy-4-methylphenyl)amino]-8-{[(trans-4-hydroxycyclohexyl)amino]methyl}-6,11-dihydro-5H-pyrido[2,3-b][1,5]benzodiazepin-5-one::US10047096, 76
SMILES: Cc1cc(F)c(Nc2ccnc3Nc4ccc(CN[C@H]5CC[C@H](O)CC5)cc4NC(=O)c23)cc1O
InChI Key: InChIKey=ZDFUUQNEPJWJNC-QAQDUYKDSA-N
Data: 2 IC50
Activity Spreadsheet -- Enzyme Inhibition Constant Data from BindingDB
Found 2 hits for monomerid = 227814
Trg + Lig
Ki
nM
ΔG°
kcal/mole
IC50
nM
Kd
nM
EC50/IC50
nM
koff
s-1
kon
M-1s-1
pHTemp
°C
Platelet-derived growth factor receptor beta
(Homo sapiens (Human))
BDBM227814
(4-[(2-Fluoro-5-hydroxy-4-methylphenyl)amino]-8-{[(...)
Show SMILES Cc1cc(F)c(Nc2ccnc3Nc4ccc(CN[C@H]5CC[C@H](O)CC5)cc4NC(=O)c23)cc1O |r,wU:22.22,wD:19.18,(-10.46,3.64,;-9.12,2.87,;-9.12,1.33,;-7.79,.56,;-7.79,-.98,;-6.46,1.33,;-5.12,.56,;-5.12,-.98,;-6.46,-1.75,;-6.46,-3.29,;-5.12,-4.06,;-3.79,-3.29,;-2.59,-4.25,;-1.08,-3.91,;-.22,-5.18,;1.32,-5.06,;1.99,-3.68,;3.53,-3.68,;4.3,-2.34,;5.84,-2.34,;6.61,-3.68,;8.15,-3.68,;8.92,-2.34,;10.46,-2.34,;8.15,-1.01,;6.61,-1.01,;1.12,-2.4,;-.42,-2.52,;-1.08,-1.13,;-2.59,-.79,;-2.98,.7,;-3.79,-1.75,;-6.46,2.87,;-7.79,3.64,;-7.79,5.18,)|
Show InChI InChI=1S/C26H28FN5O3/c1-14-10-18(27)21(12-23(14)34)30-20-8-9-28-25-24(20)26(35)32-22-11-15(2-7-19(22)31-25)13-29-16-3-5-17(33)6-4-16/h2,7-12,16-17,29,33-34H,3-6,13H2,1H3,(H,32,35)(H2,28,30,31)/t16-,17-
NCI pathway
Reactome pathway
US Patent
n/an/a 1.58n/an/an/an/a7.522
Bayer Pharma Aktiengesellschaft
US Patent
Assay Description
The kinase used was a recombinant fusion protein composed of N-terminal GST and a C-terminal fragment of human PDGFRβ (amino acids R561-L1106), expr...
US Patent US10047096 (2018)
BindingDB Entry DOI: 10.7270/Q23R0VW4
Vascular endothelial growth factor receptor 2
(Homo sapiens (Human))
BDBM227814
(4-[(2-Fluoro-5-hydroxy-4-methylphenyl)amino]-8-{[(...)
Show SMILES Cc1cc(F)c(Nc2ccnc3Nc4ccc(CN[C@H]5CC[C@H](O)CC5)cc4NC(=O)c23)cc1O |r,wU:22.22,wD:19.18,(-10.46,3.64,;-9.12,2.87,;-9.12,1.33,;-7.79,.56,;-7.79,-.98,;-6.46,1.33,;-5.12,.56,;-5.12,-.98,;-6.46,-1.75,;-6.46,-3.29,;-5.12,-4.06,;-3.79,-3.29,;-2.59,-4.25,;-1.08,-3.91,;-.22,-5.18,;1.32,-5.06,;1.99,-3.68,;3.53,-3.68,;4.3,-2.34,;5.84,-2.34,;6.61,-3.68,;8.15,-3.68,;8.92,-2.34,;10.46,-2.34,;8.15,-1.01,;6.61,-1.01,;1.12,-2.4,;-.42,-2.52,;-1.08,-1.13,;-2.59,-.79,;-2.98,.7,;-3.79,-1.75,;-6.46,2.87,;-7.79,3.64,;-7.79,5.18,)|
Show InChI InChI=1S/C26H28FN5O3/c1-14-10-18(27)21(12-23(14)34)30-20-8-9-28-25-24(20)26(35)32-22-11-15(2-7-19(22)31-25)13-29-16-3-5-17(33)6-4-16/h2,7-12,16-17,29,33-34H,3-6,13H2,1H3,(H,32,35)(H2,28,30,31)/t16-,17-
NCI pathway
Reactome pathway
US Patent
n/an/a 0.372n/an/an/an/a7.0n/a
Bayer Pharma Aktiengesellschaft
US Patent
Assay Description
The kinase used was a recombinant fusion protein composed of N-terminal GST and a C-terminal fragment of human KDR (amino acids D807-V1356), expresse...
US Patent US10047096 (2018)
BindingDB Entry DOI: 10.7270/Q23R0VW4