null
SMILES: O=S(Cc1[nH]c2ccccc2c1Sc1ccccc1)c1ccccc1
InChI Key: InChIKey=WEJMICDBYIOXOH-UHFFFAOYSA-N
Activity Spreadsheet -- Enzyme Inhibition Constant Data from BindingDB
Found 3 hits for monomerid = 2279
Trg + Lig
Ki
nM
ΔG°
kcal/mole
IC50
nM
Kd
nM
EC50/IC50
nM
koff
s-1
kon
M-1s-1
pHTemp
°C
Gag-Pol polyprotein [588-1027]/[588-1147]
(Human immunodeficiency virus type 1)
BDBM2279
(2-[(benzenesulfinyl)methyl]-3-(phenylsulfanyl)-1H-...)
Show SMILES O=S(Cc1[nH]c2ccccc2c1Sc1ccccc1)c1ccccc1
Show InChI InChI=1S/C21H17NOS2/c23-25(17-11-5-2-6-12-17)15-20-21(24-16-9-3-1-4-10-16)18-13-7-8-14-19(18)22-20/h1-14,22H,15H2
n/an/a 63n/an/an/an/a8.2n/a
Merck Research Laboratories
Assay Description
The IC50 of reverse transcriptase is the concentration that inhibits 50% of recombinant HIV-1 RT RNA-directed DNA polymerase activity in vitro.
J Med Chem 36: 1291-4 (1993)
Article DOI: 10.1021/jm00061a022
BindingDB Entry DOI: 10.7270/Q2RV0KWR
Gag-Pol polyprotein [588-1127,Y768C]/[588-1147,Y768C]
(Human immunodeficiency virus type 1)
BDBM2279
(2-[(benzenesulfinyl)methyl]-3-(phenylsulfanyl)-1H-...)
Show SMILES O=S(Cc1[nH]c2ccccc2c1Sc1ccccc1)c1ccccc1
Show InChI InChI=1S/C21H17NOS2/c23-25(17-11-5-2-6-12-17)15-20-21(24-16-9-3-1-4-10-16)18-13-7-8-14-19(18)22-20/h1-14,22H,15H2
n/an/a 2.99E+3n/an/an/an/a8.2n/a
Merck Research Laboratories
Assay Description
The IC50 of reverse transcriptase is the concentration that inhibits 50% of recombinant HIV-1 RT RNA-directed DNA polymerase activity in vitro.
J Med Chem 36: 1291-4 (1993)
Article DOI: 10.1021/jm00061a022
BindingDB Entry DOI: 10.7270/Q2RV0KWR
Gag-Pol polyprotein [588-1027,K690N]/[588-1147,K690N]
(Human immunodeficiency virus type 1)
BDBM2279
(2-[(benzenesulfinyl)methyl]-3-(phenylsulfanyl)-1H-...)
Show SMILES O=S(Cc1[nH]c2ccccc2c1Sc1ccccc1)c1ccccc1
Show InChI InChI=1S/C21H17NOS2/c23-25(17-11-5-2-6-12-17)15-20-21(24-16-9-3-1-4-10-16)18-13-7-8-14-19(18)22-20/h1-14,22H,15H2
n/an/a 2.57E+3n/an/an/an/a8.2n/a
Merck Research Laboratories
Assay Description
The IC50 of reverse transcriptase is the concentration that inhibits 50% of recombinant HIV-1 RT RNA-directed DNA polymerase activity in vitro.
J Med Chem 36: 1291-4 (1993)
Article DOI: 10.1021/jm00061a022
BindingDB Entry DOI: 10.7270/Q2RV0KWR