BDBM227906 4-[(2-Fluoro-5-hydroxy-4-methylphenyl)amino]-8-{[(2-hydroxyethyl)amino]methyl}-6,11-dihydro-5H-pyrido[2,3-b][1,5]benzodiazepin-5-one::US10047096, 167
SMILES: Cc1cc(F)c(Nc2ccnc3Nc4ccc(CNCCO)cc4NC(=O)c23)cc1O
InChI Key: InChIKey=OMASESMZSSNIBS-UHFFFAOYSA-N
Data: 2 IC50
Activity Spreadsheet -- Enzyme Inhibition Constant Data from BindingDB
Found 2 hits for monomerid = 227906
Trg + Lig
Ki
nM
ΔG°
kcal/mole
IC50
nM
Kd
nM
EC50/IC50
nM
koff
s-1
kon
M-1s-1
pHTemp
°C
Platelet-derived growth factor receptor beta
(Homo sapiens (Human))
BDBM227906
(4-[(2-Fluoro-5-hydroxy-4-methylphenyl)amino]-8-{[(...)
Show SMILES Cc1cc(F)c(Nc2ccnc3Nc4ccc(CNCCO)cc4NC(=O)c23)cc1O
Show InChI InChI=1S/C22H22FN5O3/c1-12-8-14(23)17(10-19(12)30)26-16-4-5-25-21-20(16)22(31)28-18-9-13(11-24-6-7-29)2-3-15(18)27-21/h2-5,8-10,24,29-30H,6-7,11H2,1H3,(H,28,31)(H2,25,26,27)
NCI pathway
Reactome pathway
US Patent
n/an/a 1.31n/an/an/an/a7.522
Bayer Pharma Aktiengesellschaft
US Patent
Assay Description
The kinase used was a recombinant fusion protein composed of N-terminal GST and a C-terminal fragment of human PDGFRβ (amino acids R561-L1106), expr...
US Patent US10047096 (2018)
BindingDB Entry DOI: 10.7270/Q23R0VW4
Vascular endothelial growth factor receptor 2
(Homo sapiens (Human))
BDBM227906
(4-[(2-Fluoro-5-hydroxy-4-methylphenyl)amino]-8-{[(...)
Show SMILES Cc1cc(F)c(Nc2ccnc3Nc4ccc(CNCCO)cc4NC(=O)c23)cc1O
Show InChI InChI=1S/C22H22FN5O3/c1-12-8-14(23)17(10-19(12)30)26-16-4-5-25-21-20(16)22(31)28-18-9-13(11-24-6-7-29)2-3-15(18)27-21/h2-5,8-10,24,29-30H,6-7,11H2,1H3,(H,28,31)(H2,25,26,27)
NCI pathway
Reactome pathway
US Patent
n/an/a 0.407n/an/an/an/a7.0n/a
Bayer Pharma Aktiengesellschaft
US Patent
Assay Description
The kinase used was a recombinant fusion protein composed of N-terminal GST and a C-terminal fragment of human KDR (amino acids D807-V1356), expresse...
US Patent US10047096 (2018)
BindingDB Entry DOI: 10.7270/Q23R0VW4