null
SMILES: OC(=O)C[C@H](NC(=O)c1cnc(CNS(=O)(=O)c2ccc(O)c(c2)C(O)=O)cn1)C=O
InChI Key: InChIKey=WZOPGEGZMUAACK-VIFPVBQESA-N
Activity Spreadsheet -- Enzyme Inhibition Constant Data from BindingDB
Found 1 hit for monomerid = 228
Trg + Lig
Ki
nM
ΔG°
kcal/mole
IC50
nM
Kd
nM
EC50/IC50
nM
koff
s-1
kon
M-1s-1
pHTemp
°C
Caspase-3
(Homo sapiens (Human))
BDBM228
((S)-5-{[5-(1-Carboxymethyl-2-oxo-ethylcarbamoyl)-p...)
Show SMILES OC(=O)C[C@H](NC(=O)c1cnc(CNS(=O)(=O)c2ccc(O)c(c2)C(O)=O)cn1)C=O |r|
Show InChI InChI=1S/C17H16N4O9S/c22-8-9(3-15(24)25)21-16(26)13-7-18-10(5-19-13)6-20-31(29,30)11-1-2-14(23)12(4-11)17(27)28/h1-2,4-5,7-9,20,23H,3,6H2,(H,21,26)(H,24,25)(H,27,28)/t9-/m0/s1
NCI pathway
Reactome pathway
480 -8.61n/an/an/an/an/a7.425
Sunesis Pharmaceuticals
Assay Description
The effectiveness of compounds against the activity of human recombinant caspase-1-8 was measured using fluorometric assays. Assays were carried out ...
J Med Chem 45: 5005-22 (2002)
Article DOI: 10.1021/jm020230j
BindingDB Entry DOI: 10.7270/Q2B56GW5