null
SMILES: FC(F)(F)c1nc(no1)-c1ccc(cc1)C(=O)NC1(CN2CCCC3(CC3)C2)CC1
InChI Key: InChIKey=SOUBSJUNNDFMBE-UHFFFAOYSA-N
Activity Spreadsheet -- Enzyme Inhibition Constant Data from BindingDB
Found 1 hit for monomerid = 228159
Trg + Lig
Ki
nM
ΔG°
kcal/mole
IC50
nM
Kd
nM
EC50/IC50
nM
koff
s-1
kon
M-1s-1
pHTemp
°C
Histone deacetylase 4
(Homo sapiens (Human))
BDBM228159
(US10047073, 1)
Show SMILES FC(F)(F)c1nc(no1)-c1ccc(cc1)C(=O)NC1(CN2CCCC3(CC3)C2)CC1
Show InChI InChI=1S/C21H23F3N4O2/c22-21(23,24)18-25-16(27-30-18)14-2-4-15(5-3-14)17(29)26-20(9-10-20)13-28-11-1-6-19(12-28)7-8-19/h2-5H,1,6-13H2,(H,26,29)
US Patent
n/an/a 50n/an/an/an/an/an/a
CHDI FOUNDATION, INC
US Patent
Assay Description
The Class I HDAC activity of Class IIa Histone Deacetylase (HDAC) inhibitors was quantified by measuring the cellular histone deacetylase enzymatic a...
US Patent US10047073 (2018)
BindingDB Entry DOI: 10.7270/Q2PG1TQC