BDBM228173 US10047073, 12
SMILES: CC1(C)CCCN(CC2(CC2)NC(=O)c2ccc(-c3noc(n3)C(F)(F)F)c(F)c2)C1
InChI Key: InChIKey=BUBDEPORMDPYGT-UHFFFAOYSA-N
Data: 1 IC50
Activity Spreadsheet -- Enzyme Inhibition Constant Data from BindingDB
Found 1 hit for monomerid = 228173
Trg + Lig
Ki
nM
ΔG°
kcal/mole
IC50
nM
Kd
nM
EC50/IC50
nM
koff
s-1
kon
M-1s-1
pHTemp
°C
Histone deacetylase 4
(Homo sapiens (Human))
BDBM228173
(US10047073, 12)
Show SMILES CC1(C)CCCN(CC2(CC2)NC(=O)c2ccc(-c3noc(n3)C(F)(F)F)c(F)c2)C1
Show InChI InChI=1S/C21H24F4N4O2/c1-19(2)6-3-9-29(11-19)12-20(7-8-20)27-17(30)13-4-5-14(15(22)10-13)16-26-18(31-28-16)21(23,24)25/h4-5,10H,3,6-9,11-12H2,1-2H3,(H,27,30)
US Patent
n/an/a 76n/an/an/an/an/an/a
CHDI FOUNDATION, INC
US Patent
Assay Description
The Class I HDAC activity of Class IIa Histone Deacetylase (HDAC) inhibitors was quantified by measuring the cellular histone deacetylase enzymatic a...
US Patent US10047073 (2018)
BindingDB Entry DOI: 10.7270/Q2PG1TQC