BDBM228280 US9555022, Example 02.18
SMILES: COc1cc(ccc1Nc1nc2ccc(cn2n1)-c1ccc(NC(=O)Cc2ccc(F)cc2)cc1)C(=O)N1CCS(=O)(=O)CC1
InChI Key: InChIKey=XVORETBNIVQZMC-UHFFFAOYSA-N
Data: 1 IC50
Activity Spreadsheet -- Enzyme Inhibition Constant Data from BindingDB
Found 1 hit for monomerid = 228280
Trg + Lig
Ki
nM
ΔG°
kcal/mole
IC50
nM
Kd
nM
EC50/IC50
nM
koff
s-1
kon
M-1s-1
pHTemp
°C
Dual specificity protein kinase TTK
(Homo sapiens (Human))
BDBM228280
(US9555022, Example 02.18)
Show SMILES COc1cc(ccc1Nc1nc2ccc(cn2n1)-c1ccc(NC(=O)Cc2ccc(F)cc2)cc1)C(=O)N1CCS(=O)(=O)CC1
Show InChI InChI=1S/C32H29FN6O5S/c1-44-28-19-23(31(41)38-14-16-45(42,43)17-15-38)6-12-27(28)35-32-36-29-13-7-24(20-39(29)37-32)22-4-10-26(11-5-22)34-30(40)18-21-2-8-25(33)9-3-21/h2-13,19-20H,14-18H2,1H3,(H,34,40)(H,35,37)
US Patent
n/an/a<1n/an/an/an/a7.7n/a
Bayer Intellectual Property GmbH
US Patent
Assay Description
For the assay 50 nl of a 100-fold concentrated solution of the test compound in DMSO was pipetted into a black low volume 384 well microtiter plate (...
US Patent US9555022 (2017)
BindingDB Entry DOI: 10.7270/Q25H7J86