BDBM228284 US9555022, Example 02.20
SMILES: COc1cc(ccc1Nc1nc2ccc(cn2n1)-c1ccc(NC(=O)Cc2ccc(F)cc2)cc1)C(=O)N1CCC(O)CC1
InChI Key: InChIKey=ZLGYWICQQTWJNH-UHFFFAOYSA-N
Data: 1 IC50
Activity Spreadsheet -- Enzyme Inhibition Constant Data from BindingDB
Found 1 hit for monomerid = 228284
Trg + Lig
Ki
nM
ΔG°
kcal/mole
IC50
nM
Kd
nM
EC50/IC50
nM
koff
s-1
kon
M-1s-1
pHTemp
°C
Dual specificity protein kinase TTK
(Homo sapiens (Human))
BDBM228284
(US9555022, Example 02.20)
Show SMILES COc1cc(ccc1Nc1nc2ccc(cn2n1)-c1ccc(NC(=O)Cc2ccc(F)cc2)cc1)C(=O)N1CCC(O)CC1
Show InChI InChI=1S/C33H31FN6O4/c1-44-29-19-23(32(43)39-16-14-27(41)15-17-39)6-12-28(29)36-33-37-30-13-7-24(20-40(30)38-33)22-4-10-26(11-5-22)35-31(42)18-21-2-8-25(34)9-3-21/h2-13,19-20,27,41H,14-18H2,1H3,(H,35,42)(H,36,38)
US Patent
n/an/a<1n/an/an/an/a7.7n/a
Bayer Intellectual Property GmbH
US Patent
Assay Description
For the assay 50 nl of a 100-fold concentrated solution of the test compound in DMSO was pipetted into a black low volume 384 well microtiter plate (...
US Patent US9555022 (2017)
BindingDB Entry DOI: 10.7270/Q25H7J86