BDBM22833 5,7-dichloro-2,3-dihydro-1H-indole-2,3-dione::Isatin-based compound, 53::cid_80771
SMILES: Clc1cc2C(=O)C(=O)Nc2c(Cl)c1
InChI Key: InChIKey=AYGGQJHJRFZDFH-UHFFFAOYSA-N
Data: 5 KI  1 IC50  1 EC50
Activity Spreadsheet -- Enzyme Inhibition Constant Data from BindingDB
Found 7 hits for monomerid = 22833
Trg + Lig
Ki
nM
ΔG°
kcal/mole
IC50
nM
Kd
nM
EC50/IC50
nM
koff
s-1
kon
M-1s-1
pHTemp
°C
Carboxylesterase 1
(Oryctolagus cuniculus (rabbit))
BDBM22833
(5,7-dichloro-2,3-dihydro-1H-indole-2,3-dione | Isa...)
Show SMILES Clc1cc2C(=O)C(=O)Nc2c(Cl)c1
Show InChI InChI=1S/C8H3Cl2NO2/c9-3-1-4-6(5(10)2-3)11-8(13)7(4)12/h1-2H,(H,11,12,13)
760n/an/an/an/an/an/an/an/a
St. Jude Research Hospital
Assay Description
CE inhibition was determined using a spectrophotometric multiwell plate assay with o-NPA as a substrate. The rate of change in absorbance at 420 nm w...
J Med Chem 50: 1876-85 (2007)
Article DOI: 10.1021/jm061471k
BindingDB Entry DOI: 10.7270/Q2TX3CNK
Acyl-CoA: cholesterol acyltransferase (ACAT)
(Homo sapiens (Human))
BDBM22833
(5,7-dichloro-2,3-dihydro-1H-indole-2,3-dione | Isa...)
Show SMILES Clc1cc2C(=O)C(=O)Nc2c(Cl)c1
Show InChI InChI=1S/C8H3Cl2NO2/c9-3-1-4-6(5(10)2-3)11-8(13)7(4)12/h1-2H,(H,11,12,13)
3.52E+3n/an/an/an/an/an/an/an/a
St. Jude Research Hospital
Assay Description
CE inhibition was determined using a spectrophotometric multiwell plate assay with o-NPA as a substrate. The rate of change in absorbance at 420 nm w...
J Med Chem 50: 1876-85 (2007)
Article DOI: 10.1021/jm061471k
BindingDB Entry DOI: 10.7270/Q2TX3CNK
Factor XIIa
(Homo sapiens (Human))
BDBM22833
(5,7-dichloro-2,3-dihydro-1H-indole-2,3-dione | Isa...)
Show SMILES Clc1cc2C(=O)C(=O)Nc2c(Cl)c1
Show InChI InChI=1S/C8H3Cl2NO2/c9-3-1-4-6(5(10)2-3)11-8(13)7(4)12/h1-2H,(H,11,12,13)
4.08E+3n/an/an/an/an/an/an/an/a
St. Jude Research Hospital
Assay Description
CE inhibition was determined using a spectrophotometric multiwell plate assay with o-NPA as a substrate. The rate of change in absorbance at 420 nm w...
J Med Chem 50: 1876-85 (2007)
Article DOI: 10.1021/jm061471k
BindingDB Entry DOI: 10.7270/Q2TX3CNK
Acetylcholinesterase
(Homo sapiens (Human))
BDBM22833
(5,7-dichloro-2,3-dihydro-1H-indole-2,3-dione | Isa...)
Show SMILES Clc1cc2C(=O)C(=O)Nc2c(Cl)c1
Show InChI InChI=1S/C8H3Cl2NO2/c9-3-1-4-6(5(10)2-3)11-8(13)7(4)12/h1-2H,(H,11,12,13)
NCI pathway
Reactome pathway
>1.00E+5n/an/an/an/an/an/an/an/a
St. Jude Research Hospital
Assay Description
The cholinesterase assays were performed using colorimetric method reported by Ellman. Estimates of the competitive inhibition constants (Ki) were ob...
J Med Chem 50: 1876-85 (2007)
Article DOI: 10.1021/jm061471k
BindingDB Entry DOI: 10.7270/Q2TX3CNK
Cholinesterases
(Homo sapiens (Human))
BDBM22833
(5,7-dichloro-2,3-dihydro-1H-indole-2,3-dione | Isa...)
Show SMILES Clc1cc2C(=O)C(=O)Nc2c(Cl)c1
Show InChI InChI=1S/C8H3Cl2NO2/c9-3-1-4-6(5(10)2-3)11-8(13)7(4)12/h1-2H,(H,11,12,13)
Reactome pathway
>1.00E+5n/an/an/an/an/an/an/an/a
St. Jude Research Hospital
Assay Description
The cholinesterase assays were performed using colorimetric method reported by Ellman. Estimates of the competitive inhibition constants (Ki) were ob...
J Med Chem 50: 1876-85 (2007)
Article DOI: 10.1021/jm061471k
BindingDB Entry DOI: 10.7270/Q2TX3CNK
MSRA protein
(Bos taurus)
BDBM22833
(5,7-dichloro-2,3-dihydro-1H-indole-2,3-dione | Isa...)
Show SMILES Clc1cc2C(=O)C(=O)Nc2c(Cl)c1
Show InChI InChI=1S/C8H3Cl2NO2/c9-3-1-4-6(5(10)2-3)11-8(13)7(4)12/h1-2H,(H,11,12,13)
PCBioAssay
n/an/an/an/a>1.04E+5n/an/an/an/a
The Scripps Research Institute Molecular Screening Center
Curated by PubChem BioAssay
Assay Description
Source (MLPCN Center Name): The Scripps Research Institute Molecular Screening Center (SRIMSC) Affiliation: The Scripps Research Institute, TSRI Assa...
PubChem Bioassay (2012)
BindingDB Entry DOI: 10.7270/Q2BZ64NT
DNA (cytosine-5)-methyltransferase 1 (DNMT1)
(Homo sapiens (Human))
BDBM22833
(5,7-dichloro-2,3-dihydro-1H-indole-2,3-dione | Isa...)
Show SMILES Clc1cc2C(=O)C(=O)Nc2c(Cl)c1
Show InChI InChI=1S/C8H3Cl2NO2/c9-3-1-4-6(5(10)2-3)11-8(13)7(4)12/h1-2H,(H,11,12,13)
PCBioAssay
n/an/a 1.18E+4n/an/an/an/an/an/a
Burnham Center for Chemical Genomics
Curated by PubChem BioAssay
Assay Description
Data Source: Sanford-Burnham Center for Chemical Genomics (SBCCG) Source Affiliation: Sanford-Burnham Medical Research Institute (SBMRI, San Diego, C...
PubChem Bioassay (2012)
BindingDB Entry DOI: 10.7270/Q2NC5ZRN