BDBM228369 US9555022, Example 04.34
SMILES: Cc1nc(ccc1Nc1nc2ccc(cn2n1)-c1ccc(cc1)C(=O)NCc1ccc(F)cc1)N1CCCC1
InChI Key: InChIKey=UXBTXHYAJQVSFI-UHFFFAOYSA-N
Data: 1 IC50
Activity Spreadsheet -- Enzyme Inhibition Constant Data from BindingDB
Found 1 hit for monomerid = 228369
Trg + Lig
Ki
nM
ΔG°
kcal/mole
IC50
nM
Kd
nM
EC50/IC50
nM
koff
s-1
kon
M-1s-1
pHTemp
°C
Dual specificity protein kinase TTK
(Homo sapiens (Human))
BDBM228369
(US9555022, Example 04.34)
Show SMILES Cc1nc(ccc1Nc1nc2ccc(cn2n1)-c1ccc(cc1)C(=O)NCc1ccc(F)cc1)N1CCCC1
Show InChI InChI=1S/C30H28FN7O/c1-20-26(13-15-27(33-20)37-16-2-3-17-37)34-30-35-28-14-10-24(19-38(28)36-30)22-6-8-23(9-7-22)29(39)32-18-21-4-11-25(31)12-5-21/h4-15,19H,2-3,16-18H2,1H3,(H,32,39)(H,34,36)
US Patent
n/an/a<1n/an/an/an/a7.7n/a
Bayer Intellectual Property GmbH
US Patent
Assay Description
For the assay 50 nl of a 100-fold concentrated solution of the test compound in DMSO was pipetted into a black low volume 384 well microtiter plate (...
US Patent US9555022 (2017)
BindingDB Entry DOI: 10.7270/Q25H7J86