BDBM228373 US9555022, Example 06.01
SMILES: COc1cc(ccc1Nc1nc2ccc(cn2n1)-c1ccc(C(=O)NCc2ccc(F)cc2)c(F)c1)C(=O)N1CCOCC1
InChI Key: InChIKey=VBSTZSSJMREQGP-UHFFFAOYSA-N
Data: 1 IC50
Activity Spreadsheet -- Enzyme Inhibition Constant Data from BindingDB
Found 1 hit for monomerid = 228373
Trg + Lig
Ki
nM
ΔG°
kcal/mole
IC50
nM
Kd
nM
EC50/IC50
nM
koff
s-1
kon
M-1s-1
pHTemp
°C
Dual specificity protein kinase TTK
(Homo sapiens (Human))
BDBM228373
(US9555022, Example 06.01)
Show SMILES COc1cc(ccc1Nc1nc2ccc(cn2n1)-c1ccc(C(=O)NCc2ccc(F)cc2)c(F)c1)C(=O)N1CCOCC1
Show InChI InChI=1S/C32H28F2N6O4/c1-43-28-17-22(31(42)39-12-14-44-15-13-39)5-10-27(28)36-32-37-29-11-6-23(19-40(29)38-32)21-4-9-25(26(34)16-21)30(41)35-18-20-2-7-24(33)8-3-20/h2-11,16-17,19H,12-15,18H2,1H3,(H,35,41)(H,36,38)
US Patent
n/an/a<1n/an/an/an/a7.7n/a
Bayer Intellectual Property GmbH
US Patent
Assay Description
For the assay 50 nl of a 100-fold concentrated solution of the test compound in DMSO was pipetted into a black low volume 384 well microtiter plate (...
US Patent US9555022 (2017)
BindingDB Entry DOI: 10.7270/Q25H7J86