BDBM228437 US9556135, 22
SMILES: COc1ccc(nc1)C(=O)Nc1ccc(F)c(c1)[C@]1(C)CS(=O)(=O)C(C)(C)C(N)=N1
InChI Key: InChIKey=XUTZNLTZWSGTCL-FQEVSTJZSA-N
Data: 2 IC50
Activity Spreadsheet -- Enzyme Inhibition Constant Data from BindingDB
Found 2 hits for monomerid = 228437
Trg + Lig
Ki
nM
ΔG°
kcal/mole
IC50
nM
Kd
nM
EC50/IC50
nM
koff
s-1
kon
M-1s-1
pHTemp
°C
Cathepsin D
(Homo sapiens (Human))
BDBM228437
(US9556135, 22)
Show SMILES COc1ccc(nc1)C(=O)Nc1ccc(F)c(c1)[C@]1(C)CS(=O)(=O)C(C)(C)C(N)=N1 |r,c:30|
Show InChI InChI=1S/C20H23FN4O4S/c1-19(2)18(22)25-20(3,11-30(19,27)28)14-9-12(5-7-15(14)21)24-17(26)16-8-6-13(29-4)10-23-16/h5-10H,11H2,1-4H3,(H2,22,25)(H,24,26)/t20-/m0/s1
NCI pathway
Reactome pathway
US Patent
n/an/a>4.00E+5n/an/an/an/a3.5n/a
Amgen, Inc.
US Patent
Assay Description
Recombinant Cat D was expressed in CHO cells. The assay buffer for CathepsinD is 0.05 M citrate pH 3.5, 10% DMSO final, 5 mM CHAPS. The Cat D enzyme ...
US Patent US9556135 (2017)
BindingDB Entry DOI: 10.7270/Q2X0691F
Beta-secretase 1
(Homo sapiens (Human))
BDBM228437
(US9556135, 22)
Show SMILES COc1ccc(nc1)C(=O)Nc1ccc(F)c(c1)[C@]1(C)CS(=O)(=O)C(C)(C)C(N)=N1 |r,c:30|
Show InChI InChI=1S/C20H23FN4O4S/c1-19(2)18(22)25-20(3,11-30(19,27)28)14-9-12(5-7-15(14)21)24-17(26)16-8-6-13(29-4)10-23-16/h5-10H,11H2,1-4H3,(H2,22,25)(H,24,26)/t20-/m0/s1
US Patent
n/an/a 1.5n/an/an/an/an/an/a
Amgen, Inc.
US Patent
Assay Description
Several animal models, including mouse, rat, dog, and monkey, may be used to screen for inhibition of beta-secretase activity in vivo following admin...
US Patent US9556135 (2017)
BindingDB Entry DOI: 10.7270/Q2X0691F