BDBM228443 US9556135, 38
SMILES: CC1(C)C(N)=N[C@@](C)(CS1(=O)=O)c1cc(NC(=O)c2ccc(Cl)cn2)cc(F)c1F
InChI Key: InChIKey=VDJQZEYADVRHBV-IBGZPJMESA-N
Data: 2 IC50
Activity Spreadsheet -- Enzyme Inhibition Constant Data from BindingDB
Found 2 hits for monomerid = 228443
Trg + Lig
Ki
nM
ΔG°
kcal/mole
IC50
nM
Kd
nM
EC50/IC50
nM
koff
s-1
kon
M-1s-1
pHTemp
°C
Cathepsin D
(Homo sapiens (Human))
BDBM228443
(US9556135, 38)
Show SMILES CC1(C)C(N)=N[C@@](C)(CS1(=O)=O)c1cc(NC(=O)c2ccc(Cl)cn2)cc(F)c1F |r,c:4|
Show InChI InChI=1S/C19H19ClF2N4O3S/c1-18(2)17(23)26-19(3,9-30(18,28)29)12-6-11(7-13(21)15(12)22)25-16(27)14-5-4-10(20)8-24-14/h4-8H,9H2,1-3H3,(H2,23,26)(H,25,27)/t19-/m0/s1
NCI pathway
Reactome pathway
US Patent
n/an/a 7.28E+4n/an/an/an/a3.5n/a
Amgen, Inc.
US Patent
Assay Description
Recombinant Cat D was expressed in CHO cells. The assay buffer for CathepsinD is 0.05 M citrate pH 3.5, 10% DMSO final, 5 mM CHAPS. The Cat D enzyme ...
US Patent US9556135 (2017)
BindingDB Entry DOI: 10.7270/Q2X0691F
Beta-secretase 1
(Homo sapiens (Human))
BDBM228443
(US9556135, 38)
Show SMILES CC1(C)C(N)=N[C@@](C)(CS1(=O)=O)c1cc(NC(=O)c2ccc(Cl)cn2)cc(F)c1F |r,c:4|
Show InChI InChI=1S/C19H19ClF2N4O3S/c1-18(2)17(23)26-19(3,9-30(18,28)29)12-6-11(7-13(21)15(12)22)25-16(27)14-5-4-10(20)8-24-14/h4-8H,9H2,1-3H3,(H2,23,26)(H,25,27)/t19-/m0/s1
US Patent
n/an/a 1n/an/an/an/an/an/a
Amgen, Inc.
US Patent
Assay Description
Several animal models, including mouse, rat, dog, and monkey, may be used to screen for inhibition of beta-secretase activity in vivo following admin...
US Patent US9556135 (2017)
BindingDB Entry DOI: 10.7270/Q2X0691F