BDBM228476 US9556135, 197
SMILES: CCc1cc(Cl)cnc1C(=O)Nc1ccc(F)c(c1)[C@]1(CF)CS(=O)(=O)C(C)(C)C(N)=N1
InChI Key: InChIKey=LUSNYVUXJUJPLQ-NRFANRHFSA-N
Data: 2 IC50
Activity Spreadsheet -- Enzyme Inhibition Constant Data from BindingDB
Found 2 hits for monomerid = 228476
Trg + Lig
Ki
nM
ΔG°
kcal/mole
IC50
nM
Kd
nM
EC50/IC50
nM
koff
s-1
kon
M-1s-1
pHTemp
°C
Cathepsin D
(Homo sapiens (Human))
BDBM228476
(US9556135, 197)
Show SMILES CCc1cc(Cl)cnc1C(=O)Nc1ccc(F)c(c1)[C@]1(CF)CS(=O)(=O)C(C)(C)C(N)=N1 |r,c:32|
Show InChI InChI=1S/C21H23ClF2N4O3S/c1-4-12-7-13(22)9-26-17(12)18(29)27-14-5-6-16(24)15(8-14)21(10-23)11-32(30,31)20(2,3)19(25)28-21/h5-9H,4,10-11H2,1-3H3,(H2,25,28)(H,27,29)/t21-/m0/s1
NCI pathway
Reactome pathway
US Patent
n/an/a 4.16E+5n/an/an/an/a3.5n/a
Amgen, Inc.
US Patent
Assay Description
Recombinant Cat D was expressed in CHO cells. The assay buffer for CathepsinD is 0.05 M citrate pH 3.5, 10% DMSO final, 5 mM CHAPS. The Cat D enzyme ...
US Patent US9556135 (2017)
BindingDB Entry DOI: 10.7270/Q2X0691F
Beta-secretase 1
(Homo sapiens (Human))
BDBM228476
(US9556135, 197)
Show SMILES CCc1cc(Cl)cnc1C(=O)Nc1ccc(F)c(c1)[C@]1(CF)CS(=O)(=O)C(C)(C)C(N)=N1 |r,c:32|
Show InChI InChI=1S/C21H23ClF2N4O3S/c1-4-12-7-13(22)9-26-17(12)18(29)27-14-5-6-16(24)15(8-14)21(10-23)11-32(30,31)20(2,3)19(25)28-21/h5-9H,4,10-11H2,1-3H3,(H2,25,28)(H,27,29)/t21-/m0/s1
US Patent
n/an/a 1.46n/an/an/an/an/an/a
Amgen, Inc.
US Patent
Assay Description
Several animal models, including mouse, rat, dog, and monkey, may be used to screen for inhibition of beta-secretase activity in vivo following admin...
US Patent US9556135 (2017)
BindingDB Entry DOI: 10.7270/Q2X0691F