BDBM228492 US9340521, E044
SMILES: CCc1ccc(Cc2cc([C@@H]3O[C@H](CO)[C@@H](O)[C@H](O)[C@H]3O)c3CCCCc3c2C)cc1
InChI Key: InChIKey=RFBRRXRFMKJCAK-RTJMFUJLSA-N
Data: 2 IC50
Activity Spreadsheet -- Enzyme Inhibition Constant Data from BindingDB
Found 2 hits for monomerid = 228492
Trg + Lig
Ki
nM
ΔG°
kcal/mole
IC50
nM
Kd
nM
EC50/IC50
nM
koff
s-1
kon
M-1s-1
pHTemp
°C
Sodium/glucose cotransporter 1 (SGLT1)
(Homo sapiens (Human))
BDBM228492
(US9340521, E044)
Show SMILES CCc1ccc(Cc2cc([C@@H]3O[C@H](CO)[C@@H](O)[C@H](O)[C@H]3O)c3CCCCc3c2C)cc1 |r|
Show InChI InChI=1S/C26H34O5/c1-3-16-8-10-17(11-9-16)12-18-13-21(20-7-5-4-6-19(20)15(18)2)26-25(30)24(29)23(28)22(14-27)31-26/h8-11,13,22-30H,3-7,12,14H2,1-2H3/t22-,23-,24+,25-,26+/m1/s1
US Patent
n/an/a 10.4n/an/an/an/a7.437
GREEN CROSS CORPORATION
US Patent
Assay Description
For sodium-dependent glucose transport assay, cells expressing hSGLT1 were seeded into a 96-well culture plate at a density of 5×104 cells/well...
US Patent US9340521 (2016)
BindingDB Entry DOI: 10.7270/Q2TQ60CH
Sodium/glucose cotransporter 2
(Homo sapiens (Human))
BDBM228492
(US9340521, E044)
Show SMILES CCc1ccc(Cc2cc([C@@H]3O[C@H](CO)[C@@H](O)[C@H](O)[C@H]3O)c3CCCCc3c2C)cc1 |r|
Show InChI InChI=1S/C26H34O5/c1-3-16-8-10-17(11-9-16)12-18-13-21(20-7-5-4-6-19(20)15(18)2)26-25(30)24(29)23(28)22(14-27)31-26/h8-11,13,22-30H,3-7,12,14H2,1-2H3/t22-,23-,24+,25-,26+/m1/s1
US Patent
n/an/a 0.590n/an/an/an/a7.437
GREEN CROSS CORPORATION
US Patent
Assay Description
For sodium-dependent glucose transport assay, cells expressing hSGLT2 were seeded into a 96-well culture plate at a density of 5×104 cells/well...
US Patent US9340521 (2016)
BindingDB Entry DOI: 10.7270/Q2TQ60CH