BDBM228638 US9345793, 19::US9744252, Example 19
SMILES: OC(=O)C[C@H](NC(=O)[C@@H]1CCCN(C1)C(=O)CCC1CCNCC1)c1cncc(CCc2cccc(OCCF)c2)c1
InChI Key: InChIKey=QVTQDWZYXPQJCE-UHSQPCAPSA-N
Data: 2 IC50
Activity Spreadsheet -- Enzyme Inhibition Constant Data from BindingDB
Found 2 hits for monomerid = 228638
Trg + Lig
Ki
nM
ΔG°
kcal/mole
IC50
nM
Kd
nM
EC50/IC50
nM
koff
s-1
kon
M-1s-1
pHTemp
°C
Integrin alpha-IIb
(Homo sapiens (Human))
BDBM228638
(US9345793, 19 | US9744252, Example 19)
Show SMILES OC(=O)C[C@H](NC(=O)[C@@H]1CCCN(C1)C(=O)CCC1CCNCC1)c1cncc(CCc2cccc(OCCF)c2)c1 |r|
Show InChI InChI=1S/C32H43FN4O5/c33-12-16-42-28-5-1-3-24(18-28)6-7-25-17-27(21-35-20-25)29(19-31(39)40)36-32(41)26-4-2-15-37(22-26)30(38)9-8-23-10-13-34-14-11-23/h1,3,5,17-18,20-21,23,26,29,34H,2,4,6-16,19,22H2,(H,36,41)(H,39,40)/t26-,29+/m1/s1
US Patent
n/an/a 3n/an/an/an/an/an/a
PIRAMAL IMAGING SA
US Patent
Assay Description
Purified human glycoprotein IIb/IIIa (20 mM Tris-HCl, 0.1 M NaCl, 0.1% Triton X-100, 1 mM CaCl2, 0.05% NaN3, 50% Glycerol, pH 7.4) was purchased from...
US Patent US9744252 (2017)
BindingDB Entry DOI: 10.7270/Q2F76FN7
Integrin alpha-IIb/beta-3
(Homo sapiens (Human))
BDBM228638
(US9345793, 19 | US9744252, Example 19)
Show SMILES OC(=O)C[C@H](NC(=O)[C@@H]1CCCN(C1)C(=O)CCC1CCNCC1)c1cncc(CCc2cccc(OCCF)c2)c1 |r|
Show InChI InChI=1S/C32H43FN4O5/c33-12-16-42-28-5-1-3-24(18-28)6-7-25-17-27(21-35-20-25)29(19-31(39)40)36-32(41)26-4-2-15-37(22-26)30(38)9-8-23-10-13-34-14-11-23/h1,3,5,17-18,20-21,23,26,29,34H,2,4,6-16,19,22H2,(H,36,41)(H,39,40)/t26-,29+/m1/s1
US Patent
n/an/a 3n/an/an/an/an/a2
PIRAMAL IMAGING SA
US Patent
Assay Description
The GPIIb/IIIa receptor was immobilized 48 hours at least (100 μL per well, 48 to maximum 96 hours) on a 96-well solid plate (Immuno Plate MaxiSor...
US Patent US9345793 (2016)
BindingDB Entry DOI: 10.7270/Q22806GR