BDBM2287 5-chloro-N-methyl-3-(phenylsulfanyl)-1H-indole-2-carboxamide::5Cl3PhS-2IndolCONH2 inhibitor 13
SMILES: CNC(=O)c1[nH]c2ccc(Cl)cc2c1Sc1ccccc1
InChI Key: InChIKey=BEAHKSVMGOSPPN-UHFFFAOYSA-N
Data: 1 IC50
Activity Spreadsheet -- Enzyme Inhibition Constant Data from BindingDB
Found 1 hit for monomerid = 2287
Trg + Lig
Ki
nM
ΔG°
kcal/mole
IC50
nM
Kd
nM
EC50/IC50
nM
koff
s-1
kon
M-1s-1
pHTemp
°C
HIV-1 Reverse Transcriptase
(Human immunodeficiency virus type 1)
BDBM2287
(5-chloro-N-methyl-3-(phenylsulfanyl)-1H-indole-2-c...)
Show SMILES CNC(=O)c1[nH]c2ccc(Cl)cc2c1Sc1ccccc1
Show InChI InChI=1S/C16H13ClN2OS/c1-18-16(20)14-15(21-11-5-3-2-4-6-11)12-9-10(17)7-8-13(12)19-14/h2-9,19H,1H3,(H,18,20)
n/an/a 22n/an/an/an/a8.2n/a
Merck Research Laboratories
Assay Description
The IC50 of reverse transcriptase is the concentration that inhibits 50% of recombinant HIV-1 RT RNA-directed DNA polymerase activity in vitro.
J Med Chem 36: 1291-4 (1993)
Article DOI: 10.1021/jm00061a022
BindingDB Entry DOI: 10.7270/Q2RV0KWR