BDBM22894 3-ethyl-1-[4-(1H-imidazol-4-yl)butyl]thiourea::CHEMBL309819::VUF 4681
SMILES: CCNC(=S)NCCCCc1cnc[nH]1
InChI Key: InChIKey=MCHABOYVLKVMMV-UHFFFAOYSA-N
Data: 1 KI  1 Kd
Activity Spreadsheet -- Enzyme Inhibition Constant Data from BindingDB
Found 2 hits for monomerid = 22894
Trg + Lig
Ki
nM
ΔG°
kcal/mole
IC50
nM
Kd
nM
EC50/IC50
nM
koff
s-1
kon
M-1s-1
pHTemp
°C
Histamine H4 receptor
(Homo sapiens (Human))
BDBM22894
(3-ethyl-1-[4-(1H-imidazol-4-yl)butyl]thiourea | CH...)
Show SMILES CCNC(=S)NCCCCc1cnc[nH]1
Show InChI InChI=1S/C10H18N4S/c1-2-12-10(15)13-6-4-3-5-9-7-11-8-14-9/h7-8H,2-6H2,1H3,(H,11,14)(H2,12,13,15)
Reactome pathway
25n/an/an/an/an/an/an/an/a
Vrije Universiteit Amsterdam
Assay Description
Ligand displacement assays were performed on The SK-N-MC/hH4R cell homogenates. Retained radioactivity was determined by liquid scintillation countin...
J Pharmacol Exp Ther 314: 1310-21 (2005)
Article DOI: 10.1124/jpet.105.087965
BindingDB Entry DOI: 10.7270/Q2KD1W6V
Histamine H3 receptor
(GUINEA PIG)
BDBM22894
(3-ethyl-1-[4-(1H-imidazol-4-yl)butyl]thiourea | CH...)
Show SMILES CCNC(=S)NCCCCc1cnc[nH]1
Show InChI InChI=1S/C10H18N4S/c1-2-12-10(15)13-6-4-3-5-9-7-11-8-14-9/h7-8H,2-6H2,1H3,(H,11,14)(H2,12,13,15)
n/an/an/a 39.8n/an/an/an/an/a
Vrije Universiteit Amsterdam
Curated by ChEMBL
Assay Description
In vitro inhibitory effect of histamine H3 antagonist on the electrically evoked contractile response of isolated guinea pig jejunum segments.
J Med Chem 38: 2244-50 (1995)
BindingDB Entry DOI: 10.7270/Q2RF5W7Q