null
SMILES: CC(C)NC(=S)NCCCCc1cnc[nH]1
InChI Key: InChIKey=BAFIAMAZLRISIH-UHFFFAOYSA-N
Activity Spreadsheet -- Enzyme Inhibition Constant Data from BindingDB
Found 2 hits for monomerid = 22896
Trg + Lig
Ki
nM
ΔG°
kcal/mole
IC50
nM
Kd
nM
EC50/IC50
nM
koff
s-1
kon
M-1s-1
pHTemp
°C
Histamine H4 receptor
(Homo sapiens (Human))
BDBM22896
(1-[4-(1H-imidazol-4-yl)butyl]-3-propan-2-ylthioure...)
Show SMILES CC(C)NC(=S)NCCCCc1cnc[nH]1
Show InChI InChI=1S/C11H20N4S/c1-9(2)15-11(16)13-6-4-3-5-10-7-12-8-14-10/h7-9H,3-6H2,1-2H3,(H,12,14)(H2,13,15,16)
Reactome pathway
8n/an/an/an/an/an/an/an/a
Vrije Universiteit Amsterdam
Assay Description
Ligand displacement assays were performed on The SK-N-MC/hH4R cell homogenates. Retained radioactivity was determined by liquid scintillation countin...
J Pharmacol Exp Ther 314: 1310-21 (2005)
Article DOI: 10.1124/jpet.105.087965
BindingDB Entry DOI: 10.7270/Q2KD1W6V
Histamine H3 receptor
(GUINEA PIG)
BDBM22896
(1-[4-(1H-imidazol-4-yl)butyl]-3-propan-2-ylthioure...)
Show SMILES CC(C)NC(=S)NCCCCc1cnc[nH]1
Show InChI InChI=1S/C11H20N4S/c1-9(2)15-11(16)13-6-4-3-5-10-7-12-8-14-10/h7-9H,3-6H2,1-2H3,(H,12,14)(H2,13,15,16)
n/an/an/a 31.6n/an/an/an/an/a
Vrije Universiteit Amsterdam
Curated by ChEMBL
Assay Description
In vitro inhibitory effect of histamine H3 antagonist on the electrically evoked contractile response of isolated guinea pig jejunum segments.
J Med Chem 38: 2244-50 (1995)
BindingDB Entry DOI: 10.7270/Q2RF5W7Q