BDBM22923 imidazole-4-carboxylate compound, 5::methyl 1-(2-hydroxy-1-phenylethyl)-1H-imidazole-4-carboxylate
SMILES: COC(=O)c1cn(cn1)C(CO)c1ccccc1
InChI Key: InChIKey=KSASRRZGFKXVMY-UHFFFAOYSA-N
Data: 1 KI
Activity Spreadsheet -- Enzyme Inhibition Constant Data from BindingDB
Found 1 hit for monomerid = 22923
Trg + Lig
Ki
nM
ΔG°
kcal/mole
IC50
nM
Kd
nM
EC50/IC50
nM
koff
s-1
kon
M-1s-1
pHTemp
°C
Adenosine deaminase
(Homo sapiens (Human))
BDBM22923
(imidazole-4-carboxylate compound, 5 | methyl 1-(2-...)
Show SMILES COC(=O)c1cn(cn1)C(CO)c1ccccc1
Show InChI InChI=1S/C13H14N2O3/c1-18-13(17)11-7-15(9-14-11)12(8-16)10-5-3-2-4-6-10/h2-7,9,12,16H,8H2,1H3
NCI pathway
Reactome pathway
>1.00E+5>-5.40n/an/an/an/an/a7.422
Fujisawa Pharmaceutical Co., Ltd.
Assay Description
The reaction velocity was measured by change in absorbance at 265nm (A265) resulting from the deamination of adenosine. The reaction was started by a...
Bioorg Med Chem Lett 13: 1115-8 (2003)
Article DOI: 10.1016/S0960-894X(03)00026-X
BindingDB Entry DOI: 10.7270/Q29Z936D