BDBM22938 1-[(2R)-1-hydroxy-4-[6-(3-phenylpropoxy)-1H-indol-1-yl]butan-2-yl]-1H-imidazole-4-carboxamide::Hybrid compound 1(FR235999) derivative, 6a
SMILES: NC(=O)c1cn(cn1)[C@@H](CO)CCn1ccc2ccc(OCCCc3ccccc3)cc12
InChI Key: InChIKey=YXYLHUPSWCCNBG-OAQYLSRUSA-N
Data: 1 KI
Activity Spreadsheet -- Enzyme Inhibition Constant Data from BindingDB
Found 1 hit for monomerid = 22938
Trg + Lig
Ki
nM
ΔG°
kcal/mole
IC50
nM
Kd
nM
EC50/IC50
nM
koff
s-1
kon
M-1s-1
pHTemp
°C
Adenosine deaminase
(Homo sapiens (Human))
BDBM22938
(1-[(2R)-1-hydroxy-4-[6-(3-phenylpropoxy)-1H-indol-...)
Show SMILES NC(=O)c1cn(cn1)[C@@H](CO)CCn1ccc2ccc(OCCCc3ccccc3)cc12 |r|
Show InChI InChI=1S/C25H28N4O3/c26-25(31)23-16-29(18-27-23)21(17-30)11-13-28-12-10-20-8-9-22(15-24(20)28)32-14-4-7-19-5-2-1-3-6-19/h1-3,5-6,8-10,12,15-16,18,21,30H,4,7,11,13-14,17H2,(H2,26,31)/t21-/m1/s1
NCI pathway
Reactome pathway
17 -10.5n/an/an/an/an/a7.422
Fujisawa Pharmaceutical Co., Ltd.
Assay Description
The reaction velocity was measured by change in absorbance at 265nm (A265) resulting from the deamination of adenosine. The reaction was started by a...
J Med Chem 47: 3730-43 (2004)
Article DOI: 10.1021/jm0306374
BindingDB Entry DOI: 10.7270/Q2668BG0