BDBM229508 US9556135, 168
SMILES: CC1(C)C(N)=N[C@@](C)([C@@H](F)S1(=O)=O)c1cc(Nc2nccc3cc(Cl)cnc23)ccc1F
InChI Key: InChIKey=DKWWUJQETSSBOG-GHTZIAJQSA-N
Data: 2 IC50
Activity Spreadsheet -- Enzyme Inhibition Constant Data from BindingDB
Found 2 hits for monomerid = 229508
Trg + Lig
Ki
nM
ΔG°
kcal/mole
IC50
nM
Kd
nM
EC50/IC50
nM
koff
s-1
kon
M-1s-1
pHTemp
°C
Cathepsin D
(Homo sapiens (Human))
BDBM229508
(US9556135, 168)
Show SMILES CC1(C)C(N)=N[C@@](C)([C@@H](F)S1(=O)=O)c1cc(Nc2nccc3cc(Cl)cnc23)ccc1F |r,c:4|
Show InChI InChI=1S/C21H20ClF2N5O2S/c1-20(2)19(25)29-21(3,18(24)32(20,30)31)14-9-13(4-5-15(14)23)28-17-16-11(6-7-26-17)8-12(22)10-27-16/h4-10,18H,1-3H3,(H2,25,29)(H,26,28)/t18-,21+/m0/s1
NCI pathway
Reactome pathway
US Patent
n/an/a 6.68E+4n/an/an/an/a3.5n/a
Amgen, Inc.
US Patent
Assay Description
Recombinant Cat D was expressed in CHO cells. The assay buffer for CathepsinD is 0.05 M citrate pH 3.5, 10% DMSO final, 5 mM CHAPS. The Cat D enzyme ...
US Patent US9556135 (2017)
BindingDB Entry DOI: 10.7270/Q2X0691F
Beta-secretase 1
(Homo sapiens (Human))
BDBM229508
(US9556135, 168)
Show SMILES CC1(C)C(N)=N[C@@](C)([C@@H](F)S1(=O)=O)c1cc(Nc2nccc3cc(Cl)cnc23)ccc1F |r,c:4|
Show InChI InChI=1S/C21H20ClF2N5O2S/c1-20(2)19(25)29-21(3,18(24)32(20,30)31)14-9-13(4-5-15(14)23)28-17-16-11(6-7-26-17)8-12(22)10-27-16/h4-10,18H,1-3H3,(H2,25,29)(H,26,28)/t18-,21+/m0/s1
US Patent
n/an/a 0.920n/an/an/an/an/an/a
Amgen, Inc.
US Patent
Assay Description
Several animal models, including mouse, rat, dog, and monkey, may be used to screen for inhibition of beta-secretase activity in vivo following admin...
US Patent US9556135 (2017)
BindingDB Entry DOI: 10.7270/Q2X0691F