BDBM22962 2-{1-[(4-chlorophenyl)carbonyl]-5-methoxy-2-methyl-1H-indol-3-yl}-N-(pyridin-3-yl)acetamide::CHEMBL329480::Indomethacin derivative, 15::JMC522846 Compound 12
SMILES: COc1ccc2n(C(=O)c3ccc(Cl)cc3)c(C)c(CC(=O)Nc3cccnc3)c2c1
InChI Key: InChIKey=DTAPHQYAZUTCIG-UHFFFAOYSA-N
Data: 4 IC50  1 Kd
Activity Spreadsheet -- Enzyme Inhibition Constant Data from BindingDB
Found 5 hits for monomerid = 22962
Trg + Lig
Ki
nM
ΔG°
kcal/mole
IC50
nM
Kd
nM
EC50/IC50
nM
koff
s-1
kon
M-1s-1
pHTemp
°C
Prostaglandin G/H synthase (cyclooxygenase)
(Ovis aries (Sheep))
BDBM22962
(2-{1-[(4-chlorophenyl)carbonyl]-5-methoxy-2-methyl...)
Show SMILES COc1ccc2n(C(=O)c3ccc(Cl)cc3)c(C)c(CC(=O)Nc3cccnc3)c2c1
Show InChI InChI=1S/C24H20ClN3O3/c1-15-20(13-23(29)27-18-4-3-11-26-14-18)21-12-19(31-2)9-10-22(21)28(15)24(30)16-5-7-17(25)8-6-16/h3-12,14H,13H2,1-2H3,(H,27,29)
n/an/a>6.60E+4n/an/an/an/a8.037
Vanderbilt University School of Medicine
Assay Description
For the time-dependent inhibition studies, COX enzyme was incubated with test compounds for 20 min and then analyzed for remaining COX activity by tr...
Proc Natl Acad Sci U S A 97: 925-30 (2000)
Article DOI: 10.1073/pnas.97.2.925
BindingDB Entry DOI: 10.7270/Q2XP736G
Cyclooxygenase
(Homo sapiens (Human))
BDBM22962
(2-{1-[(4-chlorophenyl)carbonyl]-5-methoxy-2-methyl...)
Show SMILES COc1ccc2n(C(=O)c3ccc(Cl)cc3)c(C)c(CC(=O)Nc3cccnc3)c2c1
Show InChI InChI=1S/C24H20ClN3O3/c1-15-20(13-23(29)27-18-4-3-11-26-14-18)21-12-19(31-2)9-10-22(21)28(15)24(30)16-5-7-17(25)8-6-16/h3-12,14H,13H2,1-2H3,(H,27,29)
NCI pathway
Reactome pathway
n/an/a 50n/an/an/an/an/a37
Vanderbilt University School of Medicine
Assay Description
For the time-dependent inhibition studies, COX enzyme was incubated with test compounds for 20 min and then analyzed for remaining COX activity by tr...
Proc Natl Acad Sci U S A 97: 925-30 (2000)
Article DOI: 10.1073/pnas.97.2.925
BindingDB Entry DOI: 10.7270/Q2XP736G
Cyclooxygenase
(Homo sapiens (Human))
BDBM22962
(2-{1-[(4-chlorophenyl)carbonyl]-5-methoxy-2-methyl...)
Show SMILES COc1ccc2n(C(=O)c3ccc(Cl)cc3)c(C)c(CC(=O)Nc3cccnc3)c2c1
Show InChI InChI=1S/C24H20ClN3O3/c1-15-20(13-23(29)27-18-4-3-11-26-14-18)21-12-19(31-2)9-10-22(21)28(15)24(30)16-5-7-17(25)8-6-16/h3-12,14H,13H2,1-2H3,(H,27,29)
NCI pathway
Reactome pathway
n/an/a 52n/an/an/an/an/an/a
Vanderbilt University School of Medicine
Curated by ChEMBL
Assay Description
In vitro inhibitory activity against human Prostaglandin G/H synthase 2 (66 nM) using [14C]-AA (50 uM) was determined
J Med Chem 43: 2860-70 (2000)
BindingDB Entry DOI: 10.7270/Q22806VP
Prostaglandin G/H synthase (cyclooxygenase)
(Ovis aries (Sheep))
BDBM22962
(2-{1-[(4-chlorophenyl)carbonyl]-5-methoxy-2-methyl...)
Show SMILES COc1ccc2n(C(=O)c3ccc(Cl)cc3)c(C)c(CC(=O)Nc3cccnc3)c2c1
Show InChI InChI=1S/C24H20ClN3O3/c1-15-20(13-23(29)27-18-4-3-11-26-14-18)21-12-19(31-2)9-10-22(21)28(15)24(30)16-5-7-17(25)8-6-16/h3-12,14H,13H2,1-2H3,(H,27,29)
n/an/a>6.60E+4n/an/an/an/an/an/a
Vanderbilt University School of Medicine
Curated by ChEMBL
Assay Description
In vitro inhibitory activity against ovine Prostaglandin G/H synthase 1 (44 nM) using [14C]AA (50 uM) was determined
J Med Chem 43: 2860-70 (2000)
BindingDB Entry DOI: 10.7270/Q22806VP
Sterol 14-alpha demethylase (CYP51)
(Trypanosoma cruzi)
BDBM22962
(2-{1-[(4-chlorophenyl)carbonyl]-5-methoxy-2-methyl...)
Show SMILES COc1ccc2n(C(=O)c3ccc(Cl)cc3)c(C)c(CC(=O)Nc3cccnc3)c2c1
Show InChI InChI=1S/C24H20ClN3O3/c1-15-20(13-23(29)27-18-4-3-11-26-14-18)21-12-19(31-2)9-10-22(21)28(15)24(30)16-5-7-17(25)8-6-16/h3-12,14H,13H2,1-2H3,(H,27,29)
n/an/an/a 290n/an/an/a7.424
Vanderbilt University
Assay Description
As a cysteine-coordinated hemoprotein, sterol 14-alpha-demethylase responds spectrally to any perturbations in the area surrounding the heme iron. Th...
J Med Chem 52: 2846-53 (2009)
Article DOI: 10.1021/jm801643b
BindingDB Entry DOI: 10.7270/Q2MP51MG