BDBM230001 US9556135, 192
SMILES: CC1(C)C(N)=N[C@@](C)(CS1(=O)=O)c1cc(Nc2ncc(Cl)c3cc(Cl)cnc23)ccc1F
InChI Key: InChIKey=WSNGUTIKROPSFW-NRFANRHFSA-N
Data: 2 IC50
Activity Spreadsheet -- Enzyme Inhibition Constant Data from BindingDB
Found 2 hits for monomerid = 230001
Trg + Lig
Ki
nM
ΔG°
kcal/mole
IC50
nM
Kd
nM
EC50/IC50
nM
koff
s-1
kon
M-1s-1
pHTemp
°C
Cathepsin D
(Homo sapiens (Human))
BDBM230001
(US9556135, 192)
Show SMILES CC1(C)C(N)=N[C@@](C)(CS1(=O)=O)c1cc(Nc2ncc(Cl)c3cc(Cl)cnc23)ccc1F |r,c:4|
Show InChI InChI=1S/C21H20Cl2FN5O2S/c1-20(2)19(25)29-21(3,10-32(20,30)31)14-7-12(4-5-16(14)24)28-18-17-13(15(23)9-27-18)6-11(22)8-26-17/h4-9H,10H2,1-3H3,(H2,25,29)(H,27,28)/t21-/m0/s1
NCI pathway
Reactome pathway
US Patent
n/an/a 3.24E+4n/an/an/an/a3.5n/a
Amgen, Inc.
US Patent
Assay Description
Recombinant Cat D was expressed in CHO cells. The assay buffer for CathepsinD is 0.05 M citrate pH 3.5, 10% DMSO final, 5 mM CHAPS. The Cat D enzyme ...
US Patent US9556135 (2017)
BindingDB Entry DOI: 10.7270/Q2X0691F
Beta-secretase 1
(Homo sapiens (Human))
BDBM230001
(US9556135, 192)
Show SMILES CC1(C)C(N)=N[C@@](C)(CS1(=O)=O)c1cc(Nc2ncc(Cl)c3cc(Cl)cnc23)ccc1F |r,c:4|
Show InChI InChI=1S/C21H20Cl2FN5O2S/c1-20(2)19(25)29-21(3,10-32(20,30)31)14-7-12(4-5-16(14)24)28-18-17-13(15(23)9-27-18)6-11(22)8-26-17/h4-9H,10H2,1-3H3,(H2,25,29)(H,27,28)/t21-/m0/s1
US Patent
n/an/a 0.700n/an/an/an/an/an/a
Amgen, Inc.
US Patent
Assay Description
Several animal models, including mouse, rat, dog, and monkey, may be used to screen for inhibition of beta-secretase activity in vivo following admin...
US Patent US9556135 (2017)
BindingDB Entry DOI: 10.7270/Q2X0691F