BDBM230022 US9556135, 207
SMILES: Cc1cc(cnc1C(=O)Nc1ccc(F)c(c1)[C@@]1(C)N=C(N)C2(CC2)S(=O)(=O)[C@H]1F)C(F)F
InChI Key: InChIKey=MVBXQCNEACOSKV-UYAOXDASSA-N
Data: 2 IC50
Activity Spreadsheet -- Enzyme Inhibition Constant Data from BindingDB
Found 2 hits for monomerid = 230022
Trg + Lig
Ki
nM
ΔG°
kcal/mole
IC50
nM
Kd
nM
EC50/IC50
nM
koff
s-1
kon
M-1s-1
pHTemp
°C
Cathepsin D
(Homo sapiens (Human))
BDBM230022
(US9556135, 207)
Show SMILES Cc1cc(cnc1C(=O)Nc1ccc(F)c(c1)[C@@]1(C)N=C(N)C2(CC2)S(=O)(=O)[C@H]1F)C(F)F |r,t:21|
Show InChI InChI=1S/C21H20F4N4O3S/c1-10-7-11(16(23)24)9-27-15(10)17(30)28-12-3-4-14(22)13(8-12)20(2)18(25)33(31,32)21(5-6-21)19(26)29-20/h3-4,7-9,16,18H,5-6H2,1-2H3,(H2,26,29)(H,28,30)/t18-,20-/m1/s1
NCI pathway
Reactome pathway
US Patent
n/an/a 5.61E+4n/an/an/an/a3.5n/a
Amgen, Inc.
US Patent
Assay Description
Recombinant Cat D was expressed in CHO cells. The assay buffer for CathepsinD is 0.05 M citrate pH 3.5, 10% DMSO final, 5 mM CHAPS. The Cat D enzyme ...
US Patent US9556135 (2017)
BindingDB Entry DOI: 10.7270/Q2X0691F
Beta-secretase 1
(Homo sapiens (Human))
BDBM230022
(US9556135, 207)
Show SMILES Cc1cc(cnc1C(=O)Nc1ccc(F)c(c1)[C@@]1(C)N=C(N)C2(CC2)S(=O)(=O)[C@H]1F)C(F)F |r,t:21|
Show InChI InChI=1S/C21H20F4N4O3S/c1-10-7-11(16(23)24)9-27-15(10)17(30)28-12-3-4-14(22)13(8-12)20(2)18(25)33(31,32)21(5-6-21)19(26)29-20/h3-4,7-9,16,18H,5-6H2,1-2H3,(H2,26,29)(H,28,30)/t18-,20-/m1/s1
US Patent
n/an/a 0.920n/an/an/an/an/an/a
Amgen, Inc.
US Patent
Assay Description
Several animal models, including mouse, rat, dog, and monkey, may be used to screen for inhibition of beta-secretase activity in vivo following admin...
US Patent US9556135 (2017)
BindingDB Entry DOI: 10.7270/Q2X0691F