BDBM230097 US10106559, Example 22::US10435415, Example 22::US9334290, 20::US9850258, Example 52
SMILES: Cc1c(cccc1-n1c(=O)[nH]c2c(F)cccc2c1=O)-c1c(F)cc(C(N)=O)c2[nH]c3cc(ccc3c12)C(C)(C)O
InChI Key: InChIKey=SXAGMGAWHSROAH-UHFFFAOYSA-N
Data: 18 IC50
Activity Spreadsheet -- Enzyme Inhibition Constant Data from BindingDB
Found 18 hits for monomerid = 230097
Trg + Lig
Ki
nM
ΔG°
kcal/mole
IC50
nM
Kd
nM
EC50/IC50
nM
koff
s-1
kon
M-1s-1
pHTemp
°C
Tyrosine-protein kinase BTK
(Homo sapiens (Human))
BDBM230097
(US10106559, Example 22 | US10435415, Example 22 | ...)
Show SMILES Cc1c(cccc1-n1c(=O)[nH]c2c(F)cccc2c1=O)-c1c(F)cc(C(N)=O)c2[nH]c3cc(ccc3c12)C(C)(C)O |(3.03,,;1.7,-.77,;.37,,;-.97,-.77,;-.97,-2.31,;.37,-3.08,;1.7,-2.31,;3.03,-3.08,;3.03,-4.62,;1.7,-5.39,;4.37,-5.39,;5.7,-4.62,;7.03,-5.39,;7.03,-6.93,;8.37,-4.62,;8.37,-3.08,;7.03,-2.31,;5.7,-3.08,;4.37,-2.31,;4.37,-.77,;.37,1.54,;1.7,2.31,;3.03,1.54,;1.7,3.85,;.37,4.62,;.37,6.16,;1.7,6.93,;-.97,6.93,;-.97,3.85,;-2.43,4.33,;-3.34,3.08,;-4.87,2.92,;-5.49,1.51,;-4.59,.27,;-3.06,.43,;-2.43,1.83,;-.97,2.31,;-7.03,1.51,;-7.03,-.03,;-8.37,.74,;-7.8,2.85,)|
Show InChI InChI=1S/C31H24F2N4O4/c1-14-16(6-5-9-23(14)37-29(39)18-7-4-8-20(32)26(18)36-30(37)40)24-21(33)13-19(28(34)38)27-25(24)17-11-10-15(31(2,3)41)12-22(17)35-27/h4-13,35,41H,1-3H3,(H2,34,38)(H,36,40)
NCI pathway
Reactome pathway
US Patent
n/an/a 0.460n/an/an/an/a7.425
Bristol-Myers Squibb Company
US Patent
Assay Description
To V-bottom 384-well plates were added test compounds, human recombinant Btk (1 nM, Invitrogen Corporation), fluoresceinated peptide (1.5 μM), ATP...
US Patent US9334290 (2016)
BindingDB Entry DOI: 10.7270/Q2BK1B6S
Tyrosine-protein kinase JAK2
(Homo sapiens (Human))
BDBM230097
(US10106559, Example 22 | US10435415, Example 22 | ...)
Show SMILES Cc1c(cccc1-n1c(=O)[nH]c2c(F)cccc2c1=O)-c1c(F)cc(C(N)=O)c2[nH]c3cc(ccc3c12)C(C)(C)O |(3.03,,;1.7,-.77,;.37,,;-.97,-.77,;-.97,-2.31,;.37,-3.08,;1.7,-2.31,;3.03,-3.08,;3.03,-4.62,;1.7,-5.39,;4.37,-5.39,;5.7,-4.62,;7.03,-5.39,;7.03,-6.93,;8.37,-4.62,;8.37,-3.08,;7.03,-2.31,;5.7,-3.08,;4.37,-2.31,;4.37,-.77,;.37,1.54,;1.7,2.31,;3.03,1.54,;1.7,3.85,;.37,4.62,;.37,6.16,;1.7,6.93,;-.97,6.93,;-.97,3.85,;-2.43,4.33,;-3.34,3.08,;-4.87,2.92,;-5.49,1.51,;-4.59,.27,;-3.06,.43,;-2.43,1.83,;-.97,2.31,;-7.03,1.51,;-7.03,-.03,;-8.37,.74,;-7.8,2.85,)|
Show InChI InChI=1S/C31H24F2N4O4/c1-14-16(6-5-9-23(14)37-29(39)18-7-4-8-20(32)26(18)36-30(37)40)24-21(33)13-19(28(34)38)27-25(24)17-11-10-15(31(2,3)41)12-22(17)35-27/h4-13,35,41H,1-3H3,(H2,34,38)(H,36,40)
Reactome pathway
US Patent
n/an/a 1.70E+3n/an/an/an/an/an/a
Bristol-Myers Squibb Company
US Patent
Assay Description
Compounds with activity against Jak2 tyrosine kinase have been observed to cause thrombocytopenia, anemia and neutropenia in human patients in clinic...
US Patent US10435415 (2019)
BindingDB Entry DOI: 10.7270/Q2C53P6V
Tyrosine-protein kinase BTK
(Homo sapiens (Human))
BDBM230097
(US10106559, Example 22 | US10435415, Example 22 | ...)
Show SMILES Cc1c(cccc1-n1c(=O)[nH]c2c(F)cccc2c1=O)-c1c(F)cc(C(N)=O)c2[nH]c3cc(ccc3c12)C(C)(C)O |(3.03,,;1.7,-.77,;.37,,;-.97,-.77,;-.97,-2.31,;.37,-3.08,;1.7,-2.31,;3.03,-3.08,;3.03,-4.62,;1.7,-5.39,;4.37,-5.39,;5.7,-4.62,;7.03,-5.39,;7.03,-6.93,;8.37,-4.62,;8.37,-3.08,;7.03,-2.31,;5.7,-3.08,;4.37,-2.31,;4.37,-.77,;.37,1.54,;1.7,2.31,;3.03,1.54,;1.7,3.85,;.37,4.62,;.37,6.16,;1.7,6.93,;-.97,6.93,;-.97,3.85,;-2.43,4.33,;-3.34,3.08,;-4.87,2.92,;-5.49,1.51,;-4.59,.27,;-3.06,.43,;-2.43,1.83,;-.97,2.31,;-7.03,1.51,;-7.03,-.03,;-8.37,.74,;-7.8,2.85,)|
Show InChI InChI=1S/C31H24F2N4O4/c1-14-16(6-5-9-23(14)37-29(39)18-7-4-8-20(32)26(18)36-30(37)40)24-21(33)13-19(28(34)38)27-25(24)17-11-10-15(31(2,3)41)12-22(17)35-27/h4-13,35,41H,1-3H3,(H2,34,38)(H,36,40)
NCI pathway
Reactome pathway
US Patent
n/an/a 0.460n/an/an/an/a7.425
Bristol-Myers Squibb Company
US Patent
Assay Description
To V-bottom 384-well plates were added test compounds, human recombinant Btk (1 nM, Invitrogen Corporation), fluoresceinated peptide (1.5 μM), A...
US Patent US10106559 (2018)
BindingDB Entry DOI: 10.7270/Q2SF2Z7Q
Tyrosine-protein kinase JAK2
(Homo sapiens (Human))
BDBM230097
(US10106559, Example 22 | US10435415, Example 22 | ...)
Show SMILES Cc1c(cccc1-n1c(=O)[nH]c2c(F)cccc2c1=O)-c1c(F)cc(C(N)=O)c2[nH]c3cc(ccc3c12)C(C)(C)O |(3.03,,;1.7,-.77,;.37,,;-.97,-.77,;-.97,-2.31,;.37,-3.08,;1.7,-2.31,;3.03,-3.08,;3.03,-4.62,;1.7,-5.39,;4.37,-5.39,;5.7,-4.62,;7.03,-5.39,;7.03,-6.93,;8.37,-4.62,;8.37,-3.08,;7.03,-2.31,;5.7,-3.08,;4.37,-2.31,;4.37,-.77,;.37,1.54,;1.7,2.31,;3.03,1.54,;1.7,3.85,;.37,4.62,;.37,6.16,;1.7,6.93,;-.97,6.93,;-.97,3.85,;-2.43,4.33,;-3.34,3.08,;-4.87,2.92,;-5.49,1.51,;-4.59,.27,;-3.06,.43,;-2.43,1.83,;-.97,2.31,;-7.03,1.51,;-7.03,-.03,;-8.37,.74,;-7.8,2.85,)|
Show InChI InChI=1S/C31H24F2N4O4/c1-14-16(6-5-9-23(14)37-29(39)18-7-4-8-20(32)26(18)36-30(37)40)24-21(33)13-19(28(34)38)27-25(24)17-11-10-15(31(2,3)41)12-22(17)35-27/h4-13,35,41H,1-3H3,(H2,34,38)(H,36,40)
Reactome pathway
US Patent
n/an/a 1.20E+3n/an/an/an/a7.425
Bristol-Myers Squibb Company
US Patent
Assay Description
Compounds with activity against Jak2 tyrosine kinase have been observed to cause thrombocytopenia, anemia and neutropenia in human patients in clinic...
US Patent US10106559 (2018)
BindingDB Entry DOI: 10.7270/Q2SF2Z7Q
Tyrosine-protein kinase BTK
(Homo sapiens (Human))
BDBM230097
(US10106559, Example 22 | US10435415, Example 22 | ...)
Show SMILES Cc1c(cccc1-n1c(=O)[nH]c2c(F)cccc2c1=O)-c1c(F)cc(C(N)=O)c2[nH]c3cc(ccc3c12)C(C)(C)O |(3.03,,;1.7,-.77,;.37,,;-.97,-.77,;-.97,-2.31,;.37,-3.08,;1.7,-2.31,;3.03,-3.08,;3.03,-4.62,;1.7,-5.39,;4.37,-5.39,;5.7,-4.62,;7.03,-5.39,;7.03,-6.93,;8.37,-4.62,;8.37,-3.08,;7.03,-2.31,;5.7,-3.08,;4.37,-2.31,;4.37,-.77,;.37,1.54,;1.7,2.31,;3.03,1.54,;1.7,3.85,;.37,4.62,;.37,6.16,;1.7,6.93,;-.97,6.93,;-.97,3.85,;-2.43,4.33,;-3.34,3.08,;-4.87,2.92,;-5.49,1.51,;-4.59,.27,;-3.06,.43,;-2.43,1.83,;-.97,2.31,;-7.03,1.51,;-7.03,-.03,;-8.37,.74,;-7.8,2.85,)|
Show InChI InChI=1S/C31H24F2N4O4/c1-14-16(6-5-9-23(14)37-29(39)18-7-4-8-20(32)26(18)36-30(37)40)24-21(33)13-19(28(34)38)27-25(24)17-11-10-15(31(2,3)41)12-22(17)35-27/h4-13,35,41H,1-3H3,(H2,34,38)(H,36,40)
NCI pathway
Reactome pathway
US Patent
n/an/a 0.480n/an/an/an/a7.425
Bristol-Myers Squibb Company
US Patent
Assay Description
To V-bottom 384-well plates were added test compounds, human recombinant Btk (1 nM, Invitrogen Corporation), fluoresceinated peptide (1.5 μM), A...
US Patent US10106559 (2018)
BindingDB Entry DOI: 10.7270/Q2SF2Z7Q
Tyrosine-protein kinase JAK2
(Homo sapiens (Human))
BDBM230097
(US10106559, Example 22 | US10435415, Example 22 | ...)
Show SMILES Cc1c(cccc1-n1c(=O)[nH]c2c(F)cccc2c1=O)-c1c(F)cc(C(N)=O)c2[nH]c3cc(ccc3c12)C(C)(C)O |(3.03,,;1.7,-.77,;.37,,;-.97,-.77,;-.97,-2.31,;.37,-3.08,;1.7,-2.31,;3.03,-3.08,;3.03,-4.62,;1.7,-5.39,;4.37,-5.39,;5.7,-4.62,;7.03,-5.39,;7.03,-6.93,;8.37,-4.62,;8.37,-3.08,;7.03,-2.31,;5.7,-3.08,;4.37,-2.31,;4.37,-.77,;.37,1.54,;1.7,2.31,;3.03,1.54,;1.7,3.85,;.37,4.62,;.37,6.16,;1.7,6.93,;-.97,6.93,;-.97,3.85,;-2.43,4.33,;-3.34,3.08,;-4.87,2.92,;-5.49,1.51,;-4.59,.27,;-3.06,.43,;-2.43,1.83,;-.97,2.31,;-7.03,1.51,;-7.03,-.03,;-8.37,.74,;-7.8,2.85,)|
Show InChI InChI=1S/C31H24F2N4O4/c1-14-16(6-5-9-23(14)37-29(39)18-7-4-8-20(32)26(18)36-30(37)40)24-21(33)13-19(28(34)38)27-25(24)17-11-10-15(31(2,3)41)12-22(17)35-27/h4-13,35,41H,1-3H3,(H2,34,38)(H,36,40)
Reactome pathway
US Patent
n/an/a 760n/an/an/an/a7.425
Bristol-Myers Squibb Company
US Patent
Assay Description
Compounds with activity against Jak2 tyrosine kinase have been observed to cause thrombocytopenia, anemia and neutropenia in human patients in clinic...
US Patent US10106559 (2018)
BindingDB Entry DOI: 10.7270/Q2SF2Z7Q
Tyrosine-protein kinase BTK
(Homo sapiens (Human))
BDBM230097
(US10106559, Example 22 | US10435415, Example 22 | ...)
Show SMILES Cc1c(cccc1-n1c(=O)[nH]c2c(F)cccc2c1=O)-c1c(F)cc(C(N)=O)c2[nH]c3cc(ccc3c12)C(C)(C)O |(3.03,,;1.7,-.77,;.37,,;-.97,-.77,;-.97,-2.31,;.37,-3.08,;1.7,-2.31,;3.03,-3.08,;3.03,-4.62,;1.7,-5.39,;4.37,-5.39,;5.7,-4.62,;7.03,-5.39,;7.03,-6.93,;8.37,-4.62,;8.37,-3.08,;7.03,-2.31,;5.7,-3.08,;4.37,-2.31,;4.37,-.77,;.37,1.54,;1.7,2.31,;3.03,1.54,;1.7,3.85,;.37,4.62,;.37,6.16,;1.7,6.93,;-.97,6.93,;-.97,3.85,;-2.43,4.33,;-3.34,3.08,;-4.87,2.92,;-5.49,1.51,;-4.59,.27,;-3.06,.43,;-2.43,1.83,;-.97,2.31,;-7.03,1.51,;-7.03,-.03,;-8.37,.74,;-7.8,2.85,)|
Show InChI InChI=1S/C31H24F2N4O4/c1-14-16(6-5-9-23(14)37-29(39)18-7-4-8-20(32)26(18)36-30(37)40)24-21(33)13-19(28(34)38)27-25(24)17-11-10-15(31(2,3)41)12-22(17)35-27/h4-13,35,41H,1-3H3,(H2,34,38)(H,36,40)
NCI pathway
Reactome pathway
US Patent
n/an/a 0.330n/an/an/an/a7.425
Bristol-Myers Squibb Company
US Patent
Assay Description
To V-bottom 384-well plates were added test compounds, human recombinant Btk (1 nM, Invitrogen Corporation), fluoresceinated peptide (1.5 μM), A...
US Patent US10106559 (2018)
BindingDB Entry DOI: 10.7270/Q2SF2Z7Q
Tyrosine-protein kinase JAK2
(Homo sapiens (Human))
BDBM230097
(US10106559, Example 22 | US10435415, Example 22 | ...)
Show SMILES Cc1c(cccc1-n1c(=O)[nH]c2c(F)cccc2c1=O)-c1c(F)cc(C(N)=O)c2[nH]c3cc(ccc3c12)C(C)(C)O |(3.03,,;1.7,-.77,;.37,,;-.97,-.77,;-.97,-2.31,;.37,-3.08,;1.7,-2.31,;3.03,-3.08,;3.03,-4.62,;1.7,-5.39,;4.37,-5.39,;5.7,-4.62,;7.03,-5.39,;7.03,-6.93,;8.37,-4.62,;8.37,-3.08,;7.03,-2.31,;5.7,-3.08,;4.37,-2.31,;4.37,-.77,;.37,1.54,;1.7,2.31,;3.03,1.54,;1.7,3.85,;.37,4.62,;.37,6.16,;1.7,6.93,;-.97,6.93,;-.97,3.85,;-2.43,4.33,;-3.34,3.08,;-4.87,2.92,;-5.49,1.51,;-4.59,.27,;-3.06,.43,;-2.43,1.83,;-.97,2.31,;-7.03,1.51,;-7.03,-.03,;-8.37,.74,;-7.8,2.85,)|
Show InChI InChI=1S/C31H24F2N4O4/c1-14-16(6-5-9-23(14)37-29(39)18-7-4-8-20(32)26(18)36-30(37)40)24-21(33)13-19(28(34)38)27-25(24)17-11-10-15(31(2,3)41)12-22(17)35-27/h4-13,35,41H,1-3H3,(H2,34,38)(H,36,40)
Reactome pathway
US Patent
n/an/a 1.70E+3n/an/an/an/a7.425
Bristol-Myers Squibb Company
US Patent
Assay Description
Compounds with activity against Jak2 tyrosine kinase have been observed to cause thrombocytopenia, anemia and neutropenia in human patients in clinic...
US Patent US10106559 (2018)
BindingDB Entry DOI: 10.7270/Q2SF2Z7Q
Tyrosine-protein kinase BTK
(Homo sapiens (Human))
BDBM230097
(US10106559, Example 22 | US10435415, Example 22 | ...)
Show SMILES Cc1c(cccc1-n1c(=O)[nH]c2c(F)cccc2c1=O)-c1c(F)cc(C(N)=O)c2[nH]c3cc(ccc3c12)C(C)(C)O |(3.03,,;1.7,-.77,;.37,,;-.97,-.77,;-.97,-2.31,;.37,-3.08,;1.7,-2.31,;3.03,-3.08,;3.03,-4.62,;1.7,-5.39,;4.37,-5.39,;5.7,-4.62,;7.03,-5.39,;7.03,-6.93,;8.37,-4.62,;8.37,-3.08,;7.03,-2.31,;5.7,-3.08,;4.37,-2.31,;4.37,-.77,;.37,1.54,;1.7,2.31,;3.03,1.54,;1.7,3.85,;.37,4.62,;.37,6.16,;1.7,6.93,;-.97,6.93,;-.97,3.85,;-2.43,4.33,;-3.34,3.08,;-4.87,2.92,;-5.49,1.51,;-4.59,.27,;-3.06,.43,;-2.43,1.83,;-.97,2.31,;-7.03,1.51,;-7.03,-.03,;-8.37,.74,;-7.8,2.85,)|
Show InChI InChI=1S/C31H24F2N4O4/c1-14-16(6-5-9-23(14)37-29(39)18-7-4-8-20(32)26(18)36-30(37)40)24-21(33)13-19(28(34)38)27-25(24)17-11-10-15(31(2,3)41)12-22(17)35-27/h4-13,35,41H,1-3H3,(H2,34,38)(H,36,40)
NCI pathway
Reactome pathway
US Patent
n/an/a 0.460n/an/an/an/an/an/a
Bristol-Myers Squibb Company
US Patent
Assay Description
To V-bottom 384-well plates were added test compounds, human recombinant Btk (1 nM, Invitrogen Corporation), fluoresceinated peptide (1.5 μM), A...
US Patent US9850258 (2017)
BindingDB Entry DOI: 10.7270/Q27S7R2C
Tyrosine-protein kinase JAK2
(Homo sapiens (Human))
BDBM230097
(US10106559, Example 22 | US10435415, Example 22 | ...)
Show SMILES Cc1c(cccc1-n1c(=O)[nH]c2c(F)cccc2c1=O)-c1c(F)cc(C(N)=O)c2[nH]c3cc(ccc3c12)C(C)(C)O |(3.03,,;1.7,-.77,;.37,,;-.97,-.77,;-.97,-2.31,;.37,-3.08,;1.7,-2.31,;3.03,-3.08,;3.03,-4.62,;1.7,-5.39,;4.37,-5.39,;5.7,-4.62,;7.03,-5.39,;7.03,-6.93,;8.37,-4.62,;8.37,-3.08,;7.03,-2.31,;5.7,-3.08,;4.37,-2.31,;4.37,-.77,;.37,1.54,;1.7,2.31,;3.03,1.54,;1.7,3.85,;.37,4.62,;.37,6.16,;1.7,6.93,;-.97,6.93,;-.97,3.85,;-2.43,4.33,;-3.34,3.08,;-4.87,2.92,;-5.49,1.51,;-4.59,.27,;-3.06,.43,;-2.43,1.83,;-.97,2.31,;-7.03,1.51,;-7.03,-.03,;-8.37,.74,;-7.8,2.85,)|
Show InChI InChI=1S/C31H24F2N4O4/c1-14-16(6-5-9-23(14)37-29(39)18-7-4-8-20(32)26(18)36-30(37)40)24-21(33)13-19(28(34)38)27-25(24)17-11-10-15(31(2,3)41)12-22(17)35-27/h4-13,35,41H,1-3H3,(H2,34,38)(H,36,40)
Reactome pathway
US Patent
n/an/a 1.20E+3n/an/an/an/an/an/a
Bristol-Myers Squibb Company
US Patent
Assay Description
The assays were performed in V-bottom 384-well plates. The final assay volume was 30 μl prepared from 15 μl additions of enzyme and substra...
US Patent US9850258 (2017)
BindingDB Entry DOI: 10.7270/Q27S7R2C
Tyrosine-protein kinase BTK
(Homo sapiens (Human))
BDBM230097
(US10106559, Example 22 | US10435415, Example 22 | ...)
Show SMILES Cc1c(cccc1-n1c(=O)[nH]c2c(F)cccc2c1=O)-c1c(F)cc(C(N)=O)c2[nH]c3cc(ccc3c12)C(C)(C)O |(3.03,,;1.7,-.77,;.37,,;-.97,-.77,;-.97,-2.31,;.37,-3.08,;1.7,-2.31,;3.03,-3.08,;3.03,-4.62,;1.7,-5.39,;4.37,-5.39,;5.7,-4.62,;7.03,-5.39,;7.03,-6.93,;8.37,-4.62,;8.37,-3.08,;7.03,-2.31,;5.7,-3.08,;4.37,-2.31,;4.37,-.77,;.37,1.54,;1.7,2.31,;3.03,1.54,;1.7,3.85,;.37,4.62,;.37,6.16,;1.7,6.93,;-.97,6.93,;-.97,3.85,;-2.43,4.33,;-3.34,3.08,;-4.87,2.92,;-5.49,1.51,;-4.59,.27,;-3.06,.43,;-2.43,1.83,;-.97,2.31,;-7.03,1.51,;-7.03,-.03,;-8.37,.74,;-7.8,2.85,)|
Show InChI InChI=1S/C31H24F2N4O4/c1-14-16(6-5-9-23(14)37-29(39)18-7-4-8-20(32)26(18)36-30(37)40)24-21(33)13-19(28(34)38)27-25(24)17-11-10-15(31(2,3)41)12-22(17)35-27/h4-13,35,41H,1-3H3,(H2,34,38)(H,36,40)
NCI pathway
Reactome pathway
US Patent
n/an/a 0.480n/an/an/an/an/an/a
Bristol-Myers Squibb Company
US Patent
Assay Description
To V-bottom 384-well plates were added test compounds, human recombinant Btk (1 nM, Invitrogen Corporation), fluoresceinated peptide (1.5 μM), A...
US Patent US9850258 (2017)
BindingDB Entry DOI: 10.7270/Q27S7R2C
Tyrosine-protein kinase JAK2
(Homo sapiens (Human))
BDBM230097
(US10106559, Example 22 | US10435415, Example 22 | ...)
Show SMILES Cc1c(cccc1-n1c(=O)[nH]c2c(F)cccc2c1=O)-c1c(F)cc(C(N)=O)c2[nH]c3cc(ccc3c12)C(C)(C)O |(3.03,,;1.7,-.77,;.37,,;-.97,-.77,;-.97,-2.31,;.37,-3.08,;1.7,-2.31,;3.03,-3.08,;3.03,-4.62,;1.7,-5.39,;4.37,-5.39,;5.7,-4.62,;7.03,-5.39,;7.03,-6.93,;8.37,-4.62,;8.37,-3.08,;7.03,-2.31,;5.7,-3.08,;4.37,-2.31,;4.37,-.77,;.37,1.54,;1.7,2.31,;3.03,1.54,;1.7,3.85,;.37,4.62,;.37,6.16,;1.7,6.93,;-.97,6.93,;-.97,3.85,;-2.43,4.33,;-3.34,3.08,;-4.87,2.92,;-5.49,1.51,;-4.59,.27,;-3.06,.43,;-2.43,1.83,;-.97,2.31,;-7.03,1.51,;-7.03,-.03,;-8.37,.74,;-7.8,2.85,)|
Show InChI InChI=1S/C31H24F2N4O4/c1-14-16(6-5-9-23(14)37-29(39)18-7-4-8-20(32)26(18)36-30(37)40)24-21(33)13-19(28(34)38)27-25(24)17-11-10-15(31(2,3)41)12-22(17)35-27/h4-13,35,41H,1-3H3,(H2,34,38)(H,36,40)
Reactome pathway
US Patent
n/an/a 1.10E+3n/an/an/an/an/an/a
Bristol-Myers Squibb Company
US Patent
Assay Description
The assays were performed in V-bottom 384-well plates. The final assay volume was 30 μl prepared from 15 μl additions of enzyme and substra...
US Patent US9850258 (2017)
BindingDB Entry DOI: 10.7270/Q27S7R2C
Tyrosine-protein kinase BTK
(Homo sapiens (Human))
BDBM230097
(US10106559, Example 22 | US10435415, Example 22 | ...)
Show SMILES Cc1c(cccc1-n1c(=O)[nH]c2c(F)cccc2c1=O)-c1c(F)cc(C(N)=O)c2[nH]c3cc(ccc3c12)C(C)(C)O |(3.03,,;1.7,-.77,;.37,,;-.97,-.77,;-.97,-2.31,;.37,-3.08,;1.7,-2.31,;3.03,-3.08,;3.03,-4.62,;1.7,-5.39,;4.37,-5.39,;5.7,-4.62,;7.03,-5.39,;7.03,-6.93,;8.37,-4.62,;8.37,-3.08,;7.03,-2.31,;5.7,-3.08,;4.37,-2.31,;4.37,-.77,;.37,1.54,;1.7,2.31,;3.03,1.54,;1.7,3.85,;.37,4.62,;.37,6.16,;1.7,6.93,;-.97,6.93,;-.97,3.85,;-2.43,4.33,;-3.34,3.08,;-4.87,2.92,;-5.49,1.51,;-4.59,.27,;-3.06,.43,;-2.43,1.83,;-.97,2.31,;-7.03,1.51,;-7.03,-.03,;-8.37,.74,;-7.8,2.85,)|
Show InChI InChI=1S/C31H24F2N4O4/c1-14-16(6-5-9-23(14)37-29(39)18-7-4-8-20(32)26(18)36-30(37)40)24-21(33)13-19(28(34)38)27-25(24)17-11-10-15(31(2,3)41)12-22(17)35-27/h4-13,35,41H,1-3H3,(H2,34,38)(H,36,40)
NCI pathway
Reactome pathway
US Patent
n/an/a 0.460n/an/an/an/an/an/a
Bristol-Myers Squibb Company
US Patent
Assay Description
To V-bottom 384-well plates were added test compounds, human recombinant Btk (1 nM, Invitrogen Corporation), fluoresceinated peptide (1.5 μM), A...
US Patent US10435415 (2019)
BindingDB Entry DOI: 10.7270/Q2C53P6V
Tyrosine-protein kinase JAK2
(Homo sapiens (Human))
BDBM230097
(US10106559, Example 22 | US10435415, Example 22 | ...)
Show SMILES Cc1c(cccc1-n1c(=O)[nH]c2c(F)cccc2c1=O)-c1c(F)cc(C(N)=O)c2[nH]c3cc(ccc3c12)C(C)(C)O |(3.03,,;1.7,-.77,;.37,,;-.97,-.77,;-.97,-2.31,;.37,-3.08,;1.7,-2.31,;3.03,-3.08,;3.03,-4.62,;1.7,-5.39,;4.37,-5.39,;5.7,-4.62,;7.03,-5.39,;7.03,-6.93,;8.37,-4.62,;8.37,-3.08,;7.03,-2.31,;5.7,-3.08,;4.37,-2.31,;4.37,-.77,;.37,1.54,;1.7,2.31,;3.03,1.54,;1.7,3.85,;.37,4.62,;.37,6.16,;1.7,6.93,;-.97,6.93,;-.97,3.85,;-2.43,4.33,;-3.34,3.08,;-4.87,2.92,;-5.49,1.51,;-4.59,.27,;-3.06,.43,;-2.43,1.83,;-.97,2.31,;-7.03,1.51,;-7.03,-.03,;-8.37,.74,;-7.8,2.85,)|
Show InChI InChI=1S/C31H24F2N4O4/c1-14-16(6-5-9-23(14)37-29(39)18-7-4-8-20(32)26(18)36-30(37)40)24-21(33)13-19(28(34)38)27-25(24)17-11-10-15(31(2,3)41)12-22(17)35-27/h4-13,35,41H,1-3H3,(H2,34,38)(H,36,40)
Reactome pathway
US Patent
n/an/a 1.20E+3n/an/an/an/an/an/a
Bristol-Myers Squibb Company
US Patent
Assay Description
Compounds with activity against Jak2 tyrosine kinase have been observed to cause thrombocytopenia, anemia and neutropenia in human patients in clinic...
US Patent US10435415 (2019)
BindingDB Entry DOI: 10.7270/Q2C53P6V
Tyrosine-protein kinase BTK
(Homo sapiens (Human))
BDBM230097
(US10106559, Example 22 | US10435415, Example 22 | ...)
Show SMILES Cc1c(cccc1-n1c(=O)[nH]c2c(F)cccc2c1=O)-c1c(F)cc(C(N)=O)c2[nH]c3cc(ccc3c12)C(C)(C)O |(3.03,,;1.7,-.77,;.37,,;-.97,-.77,;-.97,-2.31,;.37,-3.08,;1.7,-2.31,;3.03,-3.08,;3.03,-4.62,;1.7,-5.39,;4.37,-5.39,;5.7,-4.62,;7.03,-5.39,;7.03,-6.93,;8.37,-4.62,;8.37,-3.08,;7.03,-2.31,;5.7,-3.08,;4.37,-2.31,;4.37,-.77,;.37,1.54,;1.7,2.31,;3.03,1.54,;1.7,3.85,;.37,4.62,;.37,6.16,;1.7,6.93,;-.97,6.93,;-.97,3.85,;-2.43,4.33,;-3.34,3.08,;-4.87,2.92,;-5.49,1.51,;-4.59,.27,;-3.06,.43,;-2.43,1.83,;-.97,2.31,;-7.03,1.51,;-7.03,-.03,;-8.37,.74,;-7.8,2.85,)|
Show InChI InChI=1S/C31H24F2N4O4/c1-14-16(6-5-9-23(14)37-29(39)18-7-4-8-20(32)26(18)36-30(37)40)24-21(33)13-19(28(34)38)27-25(24)17-11-10-15(31(2,3)41)12-22(17)35-27/h4-13,35,41H,1-3H3,(H2,34,38)(H,36,40)
NCI pathway
Reactome pathway
US Patent
n/an/a 0.480n/an/an/an/an/an/a
Bristol-Myers Squibb Company
US Patent
Assay Description
To V-bottom 384-well plates were added test compounds, human recombinant Btk (1 nM, Invitrogen Corporation), fluoresceinated peptide (1.5 μM), A...
US Patent US10435415 (2019)
BindingDB Entry DOI: 10.7270/Q2C53P6V
Tyrosine-protein kinase JAK2
(Homo sapiens (Human))
BDBM230097
(US10106559, Example 22 | US10435415, Example 22 | ...)
Show SMILES Cc1c(cccc1-n1c(=O)[nH]c2c(F)cccc2c1=O)-c1c(F)cc(C(N)=O)c2[nH]c3cc(ccc3c12)C(C)(C)O |(3.03,,;1.7,-.77,;.37,,;-.97,-.77,;-.97,-2.31,;.37,-3.08,;1.7,-2.31,;3.03,-3.08,;3.03,-4.62,;1.7,-5.39,;4.37,-5.39,;5.7,-4.62,;7.03,-5.39,;7.03,-6.93,;8.37,-4.62,;8.37,-3.08,;7.03,-2.31,;5.7,-3.08,;4.37,-2.31,;4.37,-.77,;.37,1.54,;1.7,2.31,;3.03,1.54,;1.7,3.85,;.37,4.62,;.37,6.16,;1.7,6.93,;-.97,6.93,;-.97,3.85,;-2.43,4.33,;-3.34,3.08,;-4.87,2.92,;-5.49,1.51,;-4.59,.27,;-3.06,.43,;-2.43,1.83,;-.97,2.31,;-7.03,1.51,;-7.03,-.03,;-8.37,.74,;-7.8,2.85,)|
Show InChI InChI=1S/C31H24F2N4O4/c1-14-16(6-5-9-23(14)37-29(39)18-7-4-8-20(32)26(18)36-30(37)40)24-21(33)13-19(28(34)38)27-25(24)17-11-10-15(31(2,3)41)12-22(17)35-27/h4-13,35,41H,1-3H3,(H2,34,38)(H,36,40)
Reactome pathway
US Patent
n/an/a 760n/an/an/an/an/an/a
Bristol-Myers Squibb Company
US Patent
Assay Description
Compounds with activity against Jak2 tyrosine kinase have been observed to cause thrombocytopenia, anemia and neutropenia in human patients in clinic...
US Patent US10435415 (2019)
BindingDB Entry DOI: 10.7270/Q2C53P6V
Tyrosine-protein kinase BTK
(Homo sapiens (Human))
BDBM230097
(US10106559, Example 22 | US10435415, Example 22 | ...)
Show SMILES Cc1c(cccc1-n1c(=O)[nH]c2c(F)cccc2c1=O)-c1c(F)cc(C(N)=O)c2[nH]c3cc(ccc3c12)C(C)(C)O |(3.03,,;1.7,-.77,;.37,,;-.97,-.77,;-.97,-2.31,;.37,-3.08,;1.7,-2.31,;3.03,-3.08,;3.03,-4.62,;1.7,-5.39,;4.37,-5.39,;5.7,-4.62,;7.03,-5.39,;7.03,-6.93,;8.37,-4.62,;8.37,-3.08,;7.03,-2.31,;5.7,-3.08,;4.37,-2.31,;4.37,-.77,;.37,1.54,;1.7,2.31,;3.03,1.54,;1.7,3.85,;.37,4.62,;.37,6.16,;1.7,6.93,;-.97,6.93,;-.97,3.85,;-2.43,4.33,;-3.34,3.08,;-4.87,2.92,;-5.49,1.51,;-4.59,.27,;-3.06,.43,;-2.43,1.83,;-.97,2.31,;-7.03,1.51,;-7.03,-.03,;-8.37,.74,;-7.8,2.85,)|
Show InChI InChI=1S/C31H24F2N4O4/c1-14-16(6-5-9-23(14)37-29(39)18-7-4-8-20(32)26(18)36-30(37)40)24-21(33)13-19(28(34)38)27-25(24)17-11-10-15(31(2,3)41)12-22(17)35-27/h4-13,35,41H,1-3H3,(H2,34,38)(H,36,40)
NCI pathway
Reactome pathway
US Patent
n/an/a 0.330n/an/an/an/an/an/a
Bristol-Myers Squibb Company
US Patent
Assay Description
To V-bottom 384-well plates were added test compounds, human recombinant Btk (1 nM, Invitrogen Corporation), fluoresceinated peptide (1.5 μM), A...
US Patent US10435415 (2019)
BindingDB Entry DOI: 10.7270/Q2C53P6V
Tyrosine-protein kinase JAK2
(Homo sapiens (Human))
BDBM230097
(US10106559, Example 22 | US10435415, Example 22 | ...)
Show SMILES Cc1c(cccc1-n1c(=O)[nH]c2c(F)cccc2c1=O)-c1c(F)cc(C(N)=O)c2[nH]c3cc(ccc3c12)C(C)(C)O |(3.03,,;1.7,-.77,;.37,,;-.97,-.77,;-.97,-2.31,;.37,-3.08,;1.7,-2.31,;3.03,-3.08,;3.03,-4.62,;1.7,-5.39,;4.37,-5.39,;5.7,-4.62,;7.03,-5.39,;7.03,-6.93,;8.37,-4.62,;8.37,-3.08,;7.03,-2.31,;5.7,-3.08,;4.37,-2.31,;4.37,-.77,;.37,1.54,;1.7,2.31,;3.03,1.54,;1.7,3.85,;.37,4.62,;.37,6.16,;1.7,6.93,;-.97,6.93,;-.97,3.85,;-2.43,4.33,;-3.34,3.08,;-4.87,2.92,;-5.49,1.51,;-4.59,.27,;-3.06,.43,;-2.43,1.83,;-.97,2.31,;-7.03,1.51,;-7.03,-.03,;-8.37,.74,;-7.8,2.85,)|
Show InChI InChI=1S/C31H24F2N4O4/c1-14-16(6-5-9-23(14)37-29(39)18-7-4-8-20(32)26(18)36-30(37)40)24-21(33)13-19(28(34)38)27-25(24)17-11-10-15(31(2,3)41)12-22(17)35-27/h4-13,35,41H,1-3H3,(H2,34,38)(H,36,40)
Reactome pathway
US Patent
n/an/a 1.20E+3n/an/an/an/a7.425
Bristol-Myers Squibb Company
US Patent
Assay Description
The assays were performed in V-bottom 384-well plates. The final assay volume was 30 μl prepared from 15 μl additions of enzyme and substrates ...
US Patent US9334290 (2016)
BindingDB Entry DOI: 10.7270/Q2BK1B6S