BDBM23050 7-[4-(methylsulfanyl)phenyl]-1-[5-(pyridin-2-yl)-1,3-oxazol-2-yl]heptan-1-one::alpha-ketooxazole, 5v
SMILES: CSc1ccc(CCCCCCC(=O)c2ncc(o2)-c2ccccn2)cc1
InChI Key: InChIKey=JPUOUZLSBPJXEV-UHFFFAOYSA-N
Data: 1 KI  2 IC50
Activity Spreadsheet -- Enzyme Inhibition Constant Data from BindingDB
Found 2 hits for monomerid = 23050
Trg + Lig
Ki
nM
ΔG°
kcal/mole
IC50
nM
Kd
nM
EC50/IC50
nM
koff
s-1
kon
M-1s-1
pHTemp
°C
Fatty Acid Amide Hydrolase
(Homo sapiens (Human))
BDBM23050
(7-[4-(methylsulfanyl)phenyl]-1-[5-(pyridin-2-yl)-1...)
Show SMILES CSc1ccc(CCCCCCC(=O)c2ncc(o2)-c2ccccn2)cc1
Show InChI InChI=1S/C22H24N2O2S/c1-27-18-13-11-17(12-14-18)8-4-2-3-5-10-20(25)22-24-16-21(26-22)19-9-6-7-15-23-19/h6-7,9,11-16H,2-5,8,10H2,1H3
Reactome pathway
2.5 -11.6 20n/an/an/an/a9.022
The Scripps Research Institute
Assay Description
The inhibition assays were performed by incubating enzyme, 14C-labeled oleamide in reaction buffer at room temperature in the presence of three diffe...
J Med Chem 50: 3359-68 (2007)
Article DOI: 10.1021/jm061414r
BindingDB Entry DOI: 10.7270/Q2DR2SSH
Triacylglycerol Hydrolase
(Homo sapiens (Human))
BDBM23050
(7-[4-(methylsulfanyl)phenyl]-1-[5-(pyridin-2-yl)-1...)
Show SMILES CSc1ccc(CCCCCCC(=O)c2ncc(o2)-c2ccccn2)cc1
Show InChI InChI=1S/C22H24N2O2S/c1-27-18-13-11-17(12-14-18)8-4-2-3-5-10-20(25)22-24-16-21(26-22)19-9-6-7-15-23-19/h6-7,9,11-16H,2-5,8,10H2,1H3
n/an/a 800n/an/an/an/an/a25
The Scripps Research Institute
Assay Description
Inhibition of TGH activity was assayed using COS-7 expressed TGH and the chromogenic substrate. IC50 values were determined from the inhibition obser...
J Med Chem 50: 3359-68 (2007)
Article DOI: 10.1021/jm061414r
BindingDB Entry DOI: 10.7270/Q2DR2SSH