BDBM230695 US9340530, 29a
SMILES: C[C@H]1OC(=O)[C@]2(Cc3nnn(C)n3)CC(F)(F)[C@@H](C)[C@H](\C=C\c3ccc(cn3)-c3ccccc3Cl)C12
InChI Key: InChIKey=YRVOSPGVSZKVTN-JGKLMKEGSA-N
Data: 1 IC50
Activity Spreadsheet -- Enzyme Inhibition Constant Data from BindingDB
Found 1 hit for monomerid = 230695
Trg + Lig
Ki
nM
ΔG°
kcal/mole
IC50
nM
Kd
nM
EC50/IC50
nM
koff
s-1
kon
M-1s-1
pHTemp
°C
Proteinase-activated receptor 1
(Homo sapiens (Human))
BDBM230695
(US9340530, 29a)
Show SMILES C[C@H]1OC(=O)[C@]2(Cc3nnn(C)n3)CC(F)(F)[C@@H](C)[C@H](\C=C\c3ccc(cn3)-c3ccccc3Cl)C12 |r|
Show InChI InChI=1S/C26H26ClF2N5O2/c1-15-19(11-10-18-9-8-17(13-30-18)20-6-4-5-7-21(20)27)23-16(2)36-24(35)25(23,14-26(15,28)29)12-22-31-33-34(3)32-22/h4-11,13,15-16,19,23H,12,14H2,1-3H3/b11-10+/t15-,16+,19-,23?,25+/m0/s1
US Patent
n/an/a 2.10n/an/an/an/an/an/a
Merck Sharp & Dohme Corp.
US Patent
Assay Description
HEK 293 Cells were grown in media containing DMEM, 10% FBS pen/strep/L-Glutamine and non-essential amino acids. The cells were plated in 384-well PDL...
US Patent US9340530 (2016)
BindingDB Entry DOI: 10.7270/Q2K35SJH