BDBM230725 US9340530, 60
SMILES: [H][C@@]12[C@@H](C)OC(=O)[C@@]1(CC(F)(F)[C@@]([H])(C)[C@@H]2\C=C\c1ccc(cn1)-c1ccccc1C#N)NC(=O)c1cc(C)on1
InChI Key: InChIKey=HCQUVNARFFCDTC-GCZNCBTJSA-N
Data: 1 IC50
Activity Spreadsheet -- Enzyme Inhibition Constant Data from BindingDB
Found 1 hit for monomerid = 230725
Trg + Lig
Ki
nM
ΔG°
kcal/mole
IC50
nM
Kd
nM
EC50/IC50
nM
koff
s-1
kon
M-1s-1
pHTemp
°C
Proteinase-activated receptor 1
(Homo sapiens (Human))
BDBM230725
(US9340530, 60)
Show SMILES [H][C@@]12[C@@H](C)OC(=O)[C@@]1(CC(F)(F)[C@@]([H])(C)[C@@H]2\C=C\c1ccc(cn1)-c1ccccc1C#N)NC(=O)c1cc(C)on1 |r|
Show InChI InChI=1S/C29H26F2N4O4/c1-16-12-24(35-39-16)26(36)34-28-15-29(30,31)17(2)22(25(28)18(3)38-27(28)37)11-10-21-9-8-20(14-33-21)23-7-5-4-6-19(23)13-32/h4-12,14,17-18,22,25H,15H2,1-3H3,(H,34,36)/b11-10+/t17-,18+,22-,25-,28-/m0/s1
US Patent
n/an/a 3.40n/an/an/an/an/an/a
Merck Sharp & Dohme Corp.
US Patent
Assay Description
HEK 293 Cells were grown in media containing DMEM, 10% FBS pen/strep/L-Glutamine and non-essential amino acids. The cells were plated in 384-well PDL...
US Patent US9340530 (2016)
BindingDB Entry DOI: 10.7270/Q2K35SJH